program: Gaussian 09
title: 000246856
version: EM64L-G09RevD.01
frameworkgroup: C1[X(C15H22Cl2N2O2S)]
method: RPBEPBE
basis: SDD
operation: Freq
keyword: #p
keyword: freq=noraman
keyword: PBEPBE/SDD
title: #p freq=noraman PBEPBE/SDD
converged: YES YES NO NO
title: Mulliken charges:
elementType: Cl Cl S O O N N C C C C C C C C C C C C C C C H H H H H H H H H H H H H H H H H H H H H H
charge: -0.060320 -0.060471 0.162020 -0.412044 -0.233528 -0.171895 -0.571472 0.446687 -0.390797 -0.390172 -0.300044 0.503503 -0.729504 -0.209226 -0.807803 -0.360236 -0.359724 -0.412681 -0.396124 -0.583706 -0.583999 0.146464 0.248869 0.247049 0.247674 0.250059 0.238309 0.234741 0.277182 0.252758 0.262546 0.257300 0.258450 0.230891 0.231056 0.233540 0.236241 0.268141 0.295208 0.268038 0.292952 0.279917 0.285508 0.378643
chargesum: 0.00000
title: Mulliken charges with hydrogens summed into heavy atoms:
elementType: Cl Cl S O O N N C C C C C C C C C C C C C C C
charge: -0.060320 -0.060471 0.162020 -0.033401 -0.233528 -0.171895 -0.006047 0.446687 0.105121 0.107561 0.173006 0.503503 -0.199563 0.053320 -0.292053 -0.129345 -0.128668 -0.179141 -0.159883 -0.020357 -0.023009 0.146464
polarizability: 3.48154530e+02 3.85427828e+00 2.18758616e+02 4.29427866e+00 1.49840588e+01 1.55149611e+02
1716.lowfreq: -3.5788 -2.7030 0.0009 0.0019 0.0020 8.0091 9.5619 17.5986 20.1117
frequency: 7.5894 17.0874 20.0270 28.4052 33.9989 38.6275 41.3330 51.0383 59.5114 70.4406 71.5813 108.8271 132.9181 149.4488 165.9170 176.6990 206.1777 206.7892 214.2744 231.6432 236.5764 243.2567 274.0783 300.0714 325.3006 350.1309 378.3474 388.2028 401.7449 417.8433 493.6634 508.7960 527.6300 537.9130 586.0524 615.3750 635.8219 641.0411 660.6634 683.5309 685.6603 694.4980 712.8029 727.7542 739.2237 753.3972 781.6608 788.7943 794.6762 807.3755 813.0530 827.3306 888.6867 904.0844 940.1399 951.3968 956.2699 997.5082 999.9233 1009.0462 1024.8137 1034.8482 1035.4054 1040.4667 1041.3881 1097.4240 1119.5693 1139.4238 1147.4205 1149.4929 1179.2636 1190.7038 1204.4240 1222.3208 1223.4572 1230.4346 1245.9290 1254.6438 1256.6716 1258.7499 1276.7236 1280.4187 1294.2295 1301.0219 1326.4300 1344.2142 1352.3911 1355.9838 1368.1148 1377.2160 1387.2245 1430.0286 1439.6890 1451.2519 1458.0271 1459.0930 1459.8798 1483.5046 1503.6608 1518.0504 1571.5259 1629.0806 1652.2800 1656.3224 3008.9778 3012.7870 3012.8730 3016.3415 3018.1523 3042.5311 3063.3975 3063.6646 3068.6134 3068.9371 3074.4455 3086.1105 3093.1736 3124.6824 3127.3981 3148.0636 3148.7095 3156.5542 3161.5371 3456.6221 3500.2229 3575.5893
redmass: 8.0448 6.8687 7.0775 12.4462 7.7943 8.3782 9.0189 5.5561 3.7076 5.9302 6.1386 2.6686 2.5535 3.5800 3.7137 2.4711 1.5767 3.3281 4.9162 4.0505 4.1807 3.1847 4.6017 4.1576 2.9336 3.1956 3.6047 4.3308 3.8455 3.1215 3.0997 2.8607 3.8781 4.0635 2.3360 1.7944 5.8723 4.1526 7.0167 1.5848 4.0379 5.4252 3.5241 1.8950 3.7171 2.2235 1.1234 1.2110 2.7120 1.3463 2.5856 2.2511 1.5693 2.6508 1.3838 1.8972 1.7978 1.4222 2.9279 2.0043 2.8952 4.5231 2.0429 2.0171 2.1974 1.2406 1.4225 2.0397 1.3400 1.2221 1.6785 1.3916 1.1640 2.1286 1.3346 1.3650 2.3160 1.1621 1.1659 1.3152 1.3484 1.5867 1.1953 1.1815 1.3320 1.3709 1.2859 1.4110 1.4393 5.4865 1.7781 3.2389 1.0884 1.0955 1.0957 1.0972 1.1127 1.0893 1.1104 2.6875 6.5999 6.3698 8.7392 1.0906 1.0593 1.0580 1.0596 1.0580 1.0608 1.0844 1.0580 1.0598 1.1032 1.1002 1.1033 1.1084 1.1063 1.0889 1.0886 1.1117 1.1117 1.0937 1.0947 1.0454 1.0641 1.0965
irintensity: 0.0234 0.0849 0.2125 0.7111 0.7984 1.3594 0.9021 0.4267 0.6896 2.4541 0.1484 1.8541 1.5528 6.2943 4.4376 17.9275 29.0814 15.2896 1.4539 2.8980 3.4363 13.8949 12.3997 4.5070 21.9867 0.7970 15.0989 11.1489 8.8979 0.7956 14.1906 10.6440 10.4222 12.5330 64.4395 101.0653 9.6878 24.5775 66.4508 253.0723 16.9089 92.4785 13.9716 9.0015 13.8840 6.2612 3.0526 10.3023 7.9473 2.0256 16.6762 53.0583 2.0682 1.8483 1.2792 13.3436 11.7291 3.6692 0.1991 31.0976 135.2941 0.9020 0.1224 101.2502 5.5031 0.4169 39.8345 13.8008 10.1783 4.1739 89.0332 10.3138 24.3406 34.3031 17.5551 10.9813 17.5345 18.1379 18.7024 3.8116 44.5910 8.4233 8.7968 0.4356 6.2158 8.8452 15.4129 60.1316 10.5548 1.1078 58.7933 2.6426 2.0816 11.6227 10.7053 12.0079 6.1510 26.3527 0.2462 276.3275 4.8004 206.7645 214.2305 55.9411 4.6462 16.5216 41.2342 22.2923 17.0498 18.8477 8.5700 17.9699 1.6835 13.3603 10.6004 10.8643 21.9831 8.5735 26.5108 3.5313 18.5366 31.2991 10.0285 1.2546 15.3868 3.9436
temp: 298.150 k
press: 1.00000 atm
elementType: 17 17 16 8 8 7 7 6 6 6 6 6 6 6 6 6 6 6 6 6 6 6 1 1 1 1 1 1 1 1 1 1 1 1 1 1 1 1 1 1 1 1 1 1
symmnumber: 1
zpe: 924200.5 jmol-1
zpe.correction: 0.352009 hartree
zpe.thermalcorrener: 0.377294 hartree
zpe.thermalcorrenthalpy: 0.378238 hartree
zpe.thermalcorrgfe: 0.289297 hartree
zpe.sumelectzpe: -2161.228188 hartree
zpe.sumelectthermal: -2161.202903 hartree
zpe.sumelectthermalent: -2161.201959 hartree
zpe.sumelectthermalfe: -2161.290900 hartree
dipole: 1.8551 -1.3883 0.8974
dipole: 2.4848
quadrupole: -146.1801 -170.3517 -149.7140
quadrupole: -9.8238 -1.6464 0.9037
quadrupole: 9.2352 -14.9364 5.7013 -9.8238 -1.6464 0.9037
hfenergy: -2161.5801969 hartree
pointgroup: C01 [X(C15H22Cl2N2O2S1)]
dipole: -0.7172444 -0.5865463 -0.311783 debye
polarizability: 348.1507566|-0.9829696|215.7489022|6.3910551|-19.9777354|158.163098 unknown
InChI: InChI=1S/C15H22Cl2N2O2S/c16-6-8-19(9-7-17)13-3-1-12(2-4-13)11-22-10-5-14(18)15(20)21/h1-4,14,20H,5-11,18H2
charge 0 multiplicity 1
44 atoms
Cl 6.06815 3.866826 -0.001393
Cl 6.396842 -3.485975 0.709196
S  -2.274405 0.598709 0.708265
O  -7.324892 -0.687073 1.717708
O  -7.521214 1.097981 0.242774
N  4.369019 0.079042 0.062578
N  -6.227805 -0.483028 -1.817853
C  2.971086 -0.001267 -0.144524
C  5.145762 1.243977 -0.392627
C  5.103143 -0.993099 0.7549
C  -4.691638 -0.833574 0.137451
C  0.11973 -0.163639 -0.565962
C  -4.049692 0.560761 0.045749
C  -6.156952 -0.885309 -0.407899
C  -1.370681 -0.240311 -0.769042
C  2.226041 -1.151783 0.257176
C  2.250188 1.065417 -0.764841
C  0.834933 -1.219172 0.052237
C  0.860691 0.976901 -0.966232
C  5.084123 2.384374 0.641871
C  5.487128 -2.116283 -0.227558
C  -7.067726 -0.038943 0.502411
H  4.78361 1.603946 -1.371934
H  6.199045 0.945143 -0.53743
H  6.02233 -0.575391 1.202441
H  4.507467 -1.407445 1.587436
H  -4.111096 -1.551991 -0.468354
H  -4.682585 -1.182835 1.185864
H  -4.589595 1.306197 0.655916
H  -4.018235 0.922344 -0.997286
H  -6.490525 -1.934724 -0.318353
H  -1.719205 -1.28461 -0.824449
H  -1.693687 0.302031 -1.67434
H  2.722709 -2.004457 0.729176
H  2.7644 1.974265 -1.090899
H  0.294331 -2.115319 0.380164
H  0.338087 1.81874 -1.436057
H  5.551642 2.106045 1.598047
H  4.060323 2.749395 0.805636
H  6.184964 -1.770373 -1.004577
H  4.60863 -2.594544 -0.683518
H  -7.039801 -0.863258 -2.313971
H  -6.160984 0.532456 -1.950554
H  -7.88436 -0.102847 2.299257
