program: Gaussian 09
title: 000246835
version: EM64L-G09RevD.01
frameworkgroup: C1[X(C10H19NO)]
method: RPBEPBE
basis: SDD
operation: Freq
keyword: #p
keyword: freq=noraman
keyword: PBEPBE/SDD
title: #p freq=noraman PBEPBE/SDD
converged: YES YES NO NO
title: Mulliken charges:
elementType: O N C C C C C C C C C C H H H H H H H H H H H H H H H H H H H
charge: -0.288637 -0.149034 -0.451504 -0.452358 -0.351097 -0.357805 0.223174 -0.502771 -0.374737 -0.339591 -0.355647 -0.696910 0.253988 0.230008 0.230921 0.220524 0.221230 0.230828 0.223884 0.228311 0.221482 0.219216 0.207978 0.221729 0.179525 0.179696 0.196856 0.198444 0.216253 0.207713 0.208330
chargesum: 0.00000
title: Mulliken charges with hydrogens summed into heavy atoms:
elementType: O N C C C C C C C C C C
charge: -0.288637 -0.149034 0.000554 -0.000163 0.132900 0.093641 0.223174 -0.062073 0.054970 0.019631 0.039653 -0.064615
polarizability: 1.49013008e+02 -3.90134978e+00 1.11785117e+02 7.68852469e-01 -2.35119471e-01 8.84998242e+01
1716.lowfreq: -13.1100 -7.5030 0.0003 0.0005 0.0006 9.8142 29.5073 45.4141 62.6059
frequency: 29.3267 44.7859 62.5151 68.1114 98.5588 118.7066 138.9002 167.8373 217.8934 225.2399 233.7874 237.9567 287.8628 384.0848 432.4035 522.7708 551.3579 573.2289 680.0906 722.4445 754.4010 771.2485 841.1377 851.1533 863.3801 893.6710 911.3237 917.1866 947.8981 954.1543 987.0354 1020.0576 1058.5322 1073.0744 1077.3732 1098.2386 1111.2797 1120.3257 1153.8168 1162.0282 1178.5409 1196.6460 1216.5307 1230.7446 1240.7653 1256.0467 1282.0311 1288.9745 1292.6403 1300.9772 1311.2873 1327.8667 1335.0920 1339.7111 1356.6143 1389.3512 1392.4979 1440.5415 1462.9153 1467.3488 1468.6191 1472.7304 1477.4367 1478.7205 1487.4930 1488.2304 1498.2913 1582.0696 2946.0716 2951.6192 2952.8043 2968.9870 2970.4158 2987.8029 2989.7668 2996.8094 3000.3491 3007.9873 3009.7347 3022.3280 3036.0991 3060.3004 3062.8973 3067.4970 3070.0335 3077.7386 3091.2081
redmass: 2.4556 1.9815 3.7474 2.7610 2.7621 1.7662 2.5940 3.5300 2.9704 3.7173 1.1178 1.6462 4.3595 3.6620 3.4385 4.3409 2.3439 2.0492 3.8500 1.0820 1.1857 2.5342 1.3366 1.8087 1.8880 1.9487 2.5690 1.4724 2.1143 1.3056 2.1999 3.6834 1.9117 2.2920 2.2564 1.4338 1.6874 2.2493 1.6542 1.4693 2.5922 1.5724 1.3125 1.3281 1.3534 1.2622 1.0460 1.3079 1.2061 1.3422 1.2328 1.4193 1.5196 1.6148 1.7057 1.2194 5.2956 1.0990 1.0725 1.0881 1.0738 1.0936 1.0426 1.0708 1.0840 1.0827 1.0882 8.4292 1.0590 1.0605 1.0655 1.0533 1.0421 1.0978 1.0661 1.0741 1.0855 1.0657 1.0633 1.1027 1.0943 1.1025 1.0975 1.1011 1.0992 1.1008 1.1054
irintensity: 0.0990 0.4415 1.2823 0.0967 0.7468 0.5467 1.0265 0.9395 4.9097 4.8879 0.0283 0.6897 8.6504 4.3293 0.9150 9.1715 3.6132 1.7030 1.9488 12.8953 0.0806 0.1151 6.2096 4.3765 4.0800 4.2057 11.4437 0.1593 8.2885 0.6900 6.6651 2.2617 4.8694 0.4972 0.6786 0.4584 0.7744 8.6194 5.1036 5.4981 15.3331 0.4882 18.3028 6.5340 5.0579 0.1021 0.2840 7.0353 5.2987 2.8867 0.2418 5.1145 5.6635 24.6681 3.9967 13.1670 223.7210 20.1400 0.4427 9.8048 1.4938 11.7540 12.4103 4.9629 17.5788 3.9621 5.0299 267.3182 10.0735 20.9811 62.4604 64.5318 23.0585 8.6443 30.1466 26.2390 18.3442 23.6696 30.0301 17.2909 38.7408 9.1756 16.8439 132.1886 55.2617 28.9383 63.1976
temp: 298.150 k
press: 1.00000 atm
elementType: 8 7 6 6 6 6 6 6 6 6 6 6 1 1 1 1 1 1 1 1 1 1 1 1 1 1 1 1 1 1 1
symmnumber: 1
zpe: 723120.7 jmol-1
zpe.correction: 0.275422 hartree
zpe.thermalcorrener: 0.289355 hartree
zpe.thermalcorrenthalpy: 0.290300 hartree
zpe.thermalcorrgfe: 0.233075 hartree
zpe.sumelectzpe: -521.474856 hartree
zpe.sumelectthermal: -521.460923 hartree
zpe.sumelectthermalent: -521.459979 hartree
zpe.sumelectthermalfe: -521.517203 hartree
dipole: 2.1383 -3.9223 0.2352
dipole: 4.4735
quadrupole: -64.8224 -82.0749 -73.5340
quadrupole: -3.0010 0.2836 0.5865
quadrupole: 8.6547 -8.5978 -0.0569 -3.0010 0.2836 0.5865
hfenergy: -521.7502783 hartree
pointgroup: C01 [X(C10H19N1O1)]
dipole: -0.8512912 1.5292962 0.1847746 debye
polarizability: 149.0620624|-3.6049583|111.6245246|-0.9973369|1.6208724|88.6113624 unknown
InChI: InChI=1S/C10H19NO/c1-2-3-4-7-10(12)11-8-5-6-9-11/h2-9H2,1H3
charge 0 multiplicity 1
31 atoms
O  -0.468192 -1.949827 -0.281214
N  -1.856876 -0.113083 -0.063806
C  -4.201433 0.032141 0.342372
C  -3.686301 1.406931 -0.160117
C  -3.086587 -0.950925 -0.085774
C  -2.160966 1.331511 0.094196
C  -0.60235 -0.688912 -0.152536
C  0.593963 0.274662 -0.092827
C  1.944031 -0.462743 -0.015743
C  3.148017 0.504266 -0.022136
C  4.507439 -0.226286 0.068795
C  5.713128 0.737841 0.054991
H  -2.967529 -1.814287 0.590818
H  -3.253382 -1.353314 -1.103958
H  -1.584145 1.946208 -0.620339
H  -1.912698 1.679188 1.119034
H  -4.297371 0.042217 1.443839
H  -5.182199 -0.23827 -0.083317
H  -3.882104 1.511173 -1.243253
H  -4.154098 2.261532 0.357318
H  0.573511 0.926261 -0.992738
H  0.480156 0.95574 0.775979
H  1.965742 -1.087416 0.897945
H  2.017255 -1.170082 -0.862713
H  3.062691 1.217284 0.825686
H  3.127451 1.118705 -0.947563
H  4.529746 -0.837153 0.994182
H  4.592112 -0.940761 -0.775097
H  6.671225 0.190413 0.123882
H  5.665873 1.444511 0.905417
H  5.731796 1.335971 -0.875922
