program: Gaussian 09
title: 000246822
version: EM64L-G09RevD.01
frameworkgroup: C1[X(C19H14N2O3)]
method: RPBEPBE
basis: SDD
operation: Freq
keyword: #p
keyword: freq=noraman
keyword: PBEPBE/SDD
title: #p freq=noraman PBEPBE/SDD
converged: YES YES NO NO
title: Mulliken charges:
elementType: O O O N N C C C C C C C C C C C C C C C C C C C H H H H H H H H H H H H H H
charge: -0.223478 -0.166805 -0.234791 -0.255698 0.018831 -0.283266 -0.286041 -0.199604 -0.200526 0.175129 0.242848 -0.211681 -0.213040 -0.348490 0.272274 0.225090 0.405131 -0.376841 -0.373272 -0.439609 -0.238552 -0.426247 -0.254864 -0.246084 0.291373 0.291720 0.285859 0.283196 0.257206 0.256597 0.275802 0.289954 0.233116 0.240999 0.233145 0.239043 0.230571 0.231004
chargesum: 0.00000
title: Mulliken charges with hydrogens summed into heavy atoms:
elementType: O O O N N C C C C C C C C C C C C C C C C C C C
charge: -0.223478 -0.166805 -0.234791 -0.255698 0.018831 0.008107 0.005679 0.086256 0.082670 0.175129 0.242848 0.045525 0.043557 -0.072688 0.272274 0.225090 0.405131 -0.086887 -0.140156 -0.198609 -0.005407 -0.187203 -0.024293 -0.015080
polarizability: 3.89430086e+02 1.17218027e+01 2.54144714e+02 -1.42707391e+01 7.02255811e+00 1.05751191e+02
1716.lowfreq: -3.7051 -0.0008 -0.0007 -0.0005 3.0436 9.5530 21.0549 28.2376 50.5735
frequency: 20.9206 28.1324 50.5362 69.9039 79.2700 129.1317 137.4358 155.9961 160.0305 180.7950 189.3198 222.9241 246.7964 314.5833 360.1471 363.1490 417.4856 419.8453 434.6792 451.4887 475.2585 499.4620 514.0073 525.0156 547.6176 566.2524 577.7876 612.5951 617.9762 650.3003 657.6730 694.3243 717.1026 746.8745 748.7895 778.2646 785.0890 786.0590 790.3135 808.8755 814.4396 821.6958 837.4649 870.0162 886.9385 892.9091 905.3166 915.1278 935.6834 946.0261 960.5621 967.1220 969.2837 982.2098 989.8569 996.4716 1006.8732 1007.3817 1033.9496 1050.0579 1058.3324 1080.6188 1091.9244 1126.1759 1147.4100 1153.1877 1169.8353 1178.4474 1189.2539 1197.5466 1209.2108 1228.5512 1232.3622 1237.5192 1258.3123 1264.0447 1269.2647 1277.9767 1282.3627 1291.4913 1361.8266 1393.4591 1406.6130 1416.5363 1441.9816 1458.1438 1517.9872 1536.5148 1575.0503 1586.3150 1590.6375 1623.0889 1631.9979 1699.9297 3072.4480 3083.8278 3123.5492 3126.0566 3130.2934 3137.5475 3141.7922 3147.9010 3148.1687 3153.9601 3166.2157 3167.5497 3185.6993 3217.3022
redmass: 6.1014 6.4689 5.9575 5.1311 5.7885 3.4582 7.1336 7.4367 6.0278 3.9217 6.7309 6.7054 3.8226 5.2373 6.1201 6.3574 5.1581 4.4626 3.7974 5.3277 3.2736 5.6626 5.8741 5.6635 3.6597 9.8718 5.9856 4.9276 4.9515 3.7279 3.7135 6.3126 2.1491 5.0584 1.4152 5.0445 5.4741 5.5459 1.9089 5.2201 6.7178 1.4489 3.2880 4.2550 1.8706 3.3959 2.5554 1.6376 2.2076 1.3559 2.4205 4.6146 1.4224 1.4923 1.9583 1.3543 1.4100 4.0734 2.5179 3.9143 3.1872 1.3805 2.1158 1.4636 5.9951 1.3991 1.3344 1.1143 1.2553 1.2476 1.4770 1.3127 3.1530 1.8560 1.7344 1.5785 1.8970 1.9529 1.5024 1.8199 2.0862 2.4092 2.6236 4.6637 2.5219 2.4787 4.2197 5.1239 6.1015 7.1896 5.4680 9.6556 6.4541 12.6821 1.0856 1.0874 1.0866 1.0872 1.0902 1.0896 1.0901 1.0954 1.0922 1.0936 1.0981 1.0992 1.0883 1.1113
irintensity: 0.1008 2.6615 1.6431 1.6630 0.3887 2.5189 3.8537 4.7283 0.7337 4.0563 1.5923 1.2250 9.8752 11.7105 5.8966 8.4449 15.6570 3.7574 10.8056 0.5306 1.9723 2.6508 0.8025 0.1388 12.6911 28.8724 3.7163 1.4301 10.1574 2.2098 5.1176 14.3237 47.7395 3.6557 7.5162 8.2567 2.2725 25.7425 66.2465 15.8477 10.2901 50.1848 71.3540 3.3217 6.1112 25.0631 5.2009 0.6786 1.7928 0.2268 37.9368 16.5349 1.2202 17.7764 8.5852 1.9448 7.1235 8.4727 10.4278 10.0817 2.4457 13.7100 10.6015 9.6872 130.4899 0.6792 3.9236 0.4790 20.5023 0.0423 89.5811 0.9252 148.6220 7.2137 16.3663 14.2212 142.4344 136.1480 41.0776 13.9614 17.2713 5.3366 4.1070 13.8960 3.3836 2.1490 6.9097 62.7576 1.7373 9.0335 7.1012 303.6047 55.1894 112.2631 2.9549 7.7697 1.0605 3.0737 1.2184 7.9082 11.0730 2.0823 16.9383 33.9185 23.3091 17.8213 0.9566 8.3468
temp: 298.150 k
press: 1.00000 atm
elementType: 8 8 8 7 7 6 6 6 6 6 6 6 6 6 6 6 6 6 6 6 6 6 6 6 1 1 1 1 1 1 1 1 1 1 1 1 1 1
symmnumber: 1
zpe: 750703.4 jmol-1
zpe.correction: 0.285928 hartree
zpe.thermalcorrener: 0.304154 hartree
zpe.thermalcorrenthalpy: 0.305098 hartree
zpe.thermalcorrgfe: 0.237975 hartree
zpe.sumelectzpe: -1065.889759 hartree
zpe.sumelectthermal: -1065.871533 hartree
zpe.sumelectthermalent: -1065.870588 hartree
zpe.sumelectthermalfe: -1065.937712 hartree
dipole: 1.5918 -2.0007 -1.7063
dipole: 3.0738
quadrupole: -92.6985 -136.8258 -144.3526
quadrupole: -6.0568 -10.7635 1.9405
quadrupole: 31.9271 -12.2002 -19.7270 -6.0568 -10.7635 1.9405
hfenergy: -1066.1756866 hartree
pointgroup: C01 [X(C19H14N2O3)]
dipole: 0.6777658 -0.5899046 -0.8093942 debye
polarizability: 388.5784508|19.1293111|244.9115249|-3.7224875|39.0957749|115.8360158 unknown
InChI: InChI=1S/C19H14N2O3/c22-18-16-14-8-9-15(24-14)17(16)19(23)21(18)20-10-12-6-3-5-11-4-1-2-7-13(11)12/h1-10,14-17H
charge 0 multiplicity 1
38 atoms
O  3.948602 -0.554953 1.602632
O  2.277772 2.707407 0.409097
O  1.323065 -1.722982 -0.921762
N  1.455147 0.556732 -0.223143
N  0.131679 0.944518 0.018314
C  3.830624 0.891666 -0.267684
C  3.512093 -0.564072 -0.719641
C  4.666076 0.640143 1.059785
C  4.221304 -1.420081 0.413204
C  2.479957 1.542475 0.022749
C  1.991936 -0.693339 -0.652503
C  6.004688 0.039059 0.615807
C  5.729821 -1.233755 0.215903
C  -0.843336 0.067386 -0.157929
C  -2.229507 0.489315 0.095736
C  -3.328618 -0.444729 -0.078607
C  -4.680077 0.021455 0.181175
C  -2.494914 1.811057 0.510517
C  -3.157881 -1.809558 -0.49327
C  -4.89634 1.37413 0.599356
C  -3.820649 2.253342 0.761624
C  -5.785256 -0.879019 0.016957
C  -4.254243 -2.662774 -0.643676
C  -5.582029 -2.197937 -0.38787
H  4.390581 1.500059 -0.994346
H  3.866414 -0.834813 -1.726195
H  4.65827 1.458659 1.788585
H  3.819341 -2.427869 0.569001
H  6.952609 0.578256 0.57995
H  6.401503 -1.973986 -0.221614
H  -0.647925 -0.958843 -0.485485
H  -1.646511 2.49129 0.634794
H  -2.158606 -2.205179 -0.697999
H  -5.922701 1.709243 0.791512
H  -3.994404 3.285694 1.082821
H  -6.797489 -0.508221 0.218017
H  -4.09599 -3.699491 -0.960602
H  -6.430907 -2.879085 -0.510507
