program: Gaussian 09
title: 000246799
version: EM64L-G09RevD.01
frameworkgroup: C1[X(C11H13Cl2N3O3)]
method: RPBEPBE
basis: SDD
operation: Freq
keyword: #p
keyword: freq=noraman
keyword: PBEPBE/SDD
title: #p freq=noraman PBEPBE/SDD
converged: YES YES NO NO
title: Mulliken charges:
elementType: Cl Cl O O O N N N C C C C C C C C C C C H H H H H H H H H H H H H
charge: -0.033793 -0.047612 -0.284493 -0.218227 -0.213134 -0.179700 -0.495741 0.020417 -0.408917 -0.323707 0.291466 -0.569284 -0.575890 0.500229 -0.428293 -0.301909 0.392252 -0.348442 -0.363629 0.235983 0.269198 0.281842 0.235439 0.274293 0.280544 0.306201 0.256822 0.321803 0.230377 0.320020 0.288454 0.287431
chargesum: 0.00000
title: Mulliken charges with hydrogens summed into heavy atoms:
elementType: Cl Cl O O O N N N C C C C C C C C C C C
charge: -0.033793 -0.047612 -0.284493 -0.218227 -0.213134 -0.179700 -0.173938 0.020417 0.096264 0.193574 0.291466 -0.014448 -0.012868 0.500229 -0.197915 0.018111 0.392252 -0.059988 -0.076199
polarizability: 3.03220460e+02 5.46419653e-01 1.85982356e+02 3.29004311e+00 -2.34895306e+01 9.22442230e+01
1716.lowfreq: -5.6053 -2.8441 -0.2385 -0.0010 0.0010 0.0020 20.7121 26.4468 30.1773
frequency: 20.6739 26.4419 30.1653 32.2166 67.6098 72.1068 84.8813 93.6327 100.1627 110.0249 152.2620 184.0039 212.7929 215.5273 239.4543 264.8376 299.5268 329.2369 367.3451 409.3412 411.6538 416.3523 498.8182 508.7461 516.8624 592.5243 607.4802 633.7985 654.7222 667.0738 693.3614 697.1734 717.3748 736.0230 771.1528 780.6389 788.1845 832.6526 842.3056 865.0799 879.5737 978.1071 987.5443 998.3107 1000.0199 1011.4733 1034.4055 1046.1266 1063.0155 1097.5141 1118.8599 1121.2869 1164.2124 1180.0982 1225.6130 1232.1994 1253.3056 1257.3703 1263.9869 1269.5300 1299.4618 1301.7917 1343.3740 1352.4372 1362.6367 1372.5984 1397.4843 1429.7819 1450.4842 1458.9209 1465.4105 1486.6235 1498.5311 1522.6697 1597.2223 1614.3959 1624.0172 3001.8830 3032.8281 3059.9385 3061.1335 3070.0837 3103.2755 3122.2435 3143.6457 3153.7278 3178.4807 3185.4013 3204.8848 3542.5675
redmass: 8.5146 7.3702 13.8042 12.6543 6.8398 5.8553 3.2459 4.9165 2.9345 5.0794 5.6750 10.9218 4.9375 4.5571 6.8288 5.6812 5.1460 4.6054 5.6886 3.2506 8.9528 3.0722 2.7252 7.3899 4.7622 1.2819 5.8767 6.9876 7.6635 4.7159 6.2179 6.2584 6.2343 4.7434 2.4674 1.5638 1.2994 1.3880 5.1264 5.8523 1.4859 1.3409 1.9933 2.2628 1.7623 1.3151 4.4252 2.6854 2.1956 2.9189 1.3056 1.3730 2.0318 1.4181 4.2049 2.4387 1.2093 1.2836 1.3549 1.6320 1.3913 1.4426 1.4139 3.9861 1.4026 1.8685 4.5490 4.9969 1.0881 1.0961 1.0951 2.1610 1.5869 1.6063 7.0901 4.7621 5.3537 1.0654 1.0617 1.0592 1.0579 1.0966 1.1034 1.0909 1.1117 1.1114 1.0909 1.0945 1.0955 1.0755
irintensity: 1.4518 0.0466 1.4302 1.1449 0.9228 1.7217 2.5247 7.1417 3.6971 0.7301 0.6298 0.8853 3.6146 3.5924 5.6135 1.7157 1.3806 13.8551 11.2493 0.2071 17.9673 0.5685 32.7938 1.7821 9.9005 43.3071 11.0928 10.7085 27.6646 26.2528 23.8658 22.4398 62.8351 8.2208 11.7099 30.2332 2.9123 26.9393 2.4141 0.4642 66.7464 1.3406 19.0389 1.5321 1.3107 0.2941 0.8681 0.7827 0.1370 24.4603 10.1094 58.3616 445.9200 139.7662 554.1224 15.2511 34.0735 63.1401 38.7005 11.8241 68.6490 7.6078 9.5410 59.2683 48.7828 43.1700 378.1267 47.3039 19.9443 11.4128 30.4329 6.4932 420.1757 296.8878 79.4392 72.0946 375.1213 16.0079 13.7374 7.6386 22.6883 11.8252 1.7332 14.6155 14.0582 6.9518 2.3957 3.1641 6.8737 20.5373
temp: 298.150 k
press: 1.00000 atm
elementType: 17 17 8 8 8 7 7 7 6 6 6 6 6 6 6 6 6 6 6 1 1 1 1 1 1 1 1 1 1 1 1 1
symmnumber: 1
zpe: 623043.3 jmol-1
zpe.correction: 0.237305 hartree
zpe.thermalcorrener: 0.256434 hartree
zpe.thermalcorrenthalpy: 0.257378 hartree
zpe.thermalcorrgfe: 0.185156 hartree
zpe.sumelectzpe: -1735.538237 hartree
zpe.sumelectthermal: -1735.519108 hartree
zpe.sumelectthermalent: -1735.518164 hartree
zpe.sumelectthermalfe: -1735.590385 hartree
dipole: 6.0115 3.6110 -0.9466
dipole: 7.0763
quadrupole: -180.8816 -138.5875 -123.1407
quadrupole: 1.0645 0.2002 0.6939
quadrupole: -33.3450 8.9491 24.3959 1.0645 0.2002 0.6939
hfenergy: -1735.7755415 hartree
pointgroup: C01 [X(C11H13Cl2N3O3)]
dipole: -2.3917524 1.3734245 0.3794063 debye
polarizability: 303.0523908|3.5483185|188.5056684|-5.3605948|17.7344657|89.8889801 unknown
InChI: InChI=1S/C11H13Cl2N3O3/c12-5-7-15(8-6-13)11(17)14-9-1-3-10(4-2-9)16(18)19/h1-4,14H,5-8H2
charge 0 multiplicity 1
32 atoms
Cl -3.59495 4.062684 -0.160764
Cl -5.750529 -2.911627 0.616135
O  -1.32375 -1.702573 -0.474882
O  5.872429 0.851114 0.145818
O  5.644688 -1.336004 -0.468826
N  -2.845818 -0.012938 0.037238
N  -0.509133 0.433608 0.103206
N  5.152723 -0.186668 -0.138174
C  -3.190414 1.36253 0.445406
C  -3.951136 -0.961582 -0.246055
C  -1.537608 -0.501245 -0.133622
C  -3.222322 2.316549 -0.76605
C  -4.253211 -1.827443 0.987978
C  0.887061 0.212343 0.026074
C  1.730025 1.323387 0.326019
C  1.469975 -1.037312 -0.33063
C  3.685777 -0.048556 -0.081263
C  3.124943 1.199506 0.274354
C  2.868657 -1.160881 -0.382224
H  -2.498695 1.744059 1.220772
H  -4.186306 1.351257 0.920558
H  -3.661783 -1.613775 -1.085672
H  -4.847445 -0.386962 -0.537828
H  -2.258119 2.376313 -1.293096
H  -4.023755 2.058227 -1.473339
H  -3.42456 -2.513217 1.211478
H  -4.527049 -1.230329 1.871188
H  -0.773334 1.381269 0.376191
H  1.28581 2.288225 0.60132
H  0.821216 -1.883016 -0.560347
H  3.785062 2.040312 0.50138
H  3.338754 -2.109851 -0.653543
