program: Gaussian 09
title: 000246772
version: EM64L-G09RevD.01
frameworkgroup: C1[X(C9H11ClO)]
method: RPBEPBE
basis: SDD
operation: Freq
keyword: #p
keyword: freq=noraman
keyword: PBEPBE/SDD
title: #p freq=noraman PBEPBE/SDD
converged: NO NO NO NO
title: Mulliken charges:
elementType: Cl O C C C C C C C C C H H H H H H H H H H H
charge: -0.063317 -0.420336 0.468063 0.142427 0.608492 -0.531236 0.104867 -0.599897 -0.831892 -0.810870 -0.806364 0.259189 0.252163 0.252126 0.236986 0.250229 0.250154 0.189668 0.243453 0.243465 0.225184 0.337443
chargesum: 0.00000
title: Mulliken charges with hydrogens summed into heavy atoms:
elementType: Cl O C C C C C C C C C
charge: -0.063317 -0.082893 0.468063 0.142427 0.608492 -0.531236 0.104867 -0.340707 -0.090616 -0.120819 -0.094262
polarizability: 1.45296489e+02 9.69930725e-01 1.25659491e+02 1.14256262e-03 -1.46129191e-03 5.82090357e+01
1716.lowfreq: -7.7874 -5.0774 -0.0022 -0.0012 -0.0007 9.3532 34.7439 89.7970 111.5597
frequency: 33.6255 89.7703 111.5243 142.2175 151.2778 196.3879 231.8441 267.2985 278.6670 309.8819 329.2066 365.5588 369.4052 370.7612 449.1315 534.6122 550.8313 562.2104 604.0334 607.5245 729.9739 760.9926 875.5370 912.4207 986.5444 1004.8240 1021.3264 1038.4527 1047.1678 1048.2163 1073.2150 1135.2452 1157.8268 1238.5183 1331.5535 1362.7723 1397.2760 1398.6210 1402.3120 1415.9871 1449.4956 1456.8260 1461.4245 1472.0278 1478.4737 1483.5133 1499.3423 1578.4092 1625.7106 2973.0207 2982.4135 2988.5703 3049.1828 3060.1677 3061.6073 3062.1137 3093.4868 3115.3627 3158.4713 3592.3588
redmass: 1.0982 3.8190 1.7905 1.1970 1.3435 2.3571 6.9214 2.1302 3.1516 1.7244 4.0018 3.1837 3.9201 4.3814 4.9883 3.1997 3.4215 4.3550 5.5239 5.1667 3.2989 3.8245 1.4584 2.2786 4.3763 1.3738 1.4025 1.7793 1.5857 1.5204 2.3837 1.6289 2.4763 1.6565 7.2210 5.5915 1.7761 1.2317 1.4061 1.4706 2.1580 1.0440 1.0455 1.2382 1.3069 1.0436 1.2200 5.5010 7.1338 1.0372 1.0366 1.0390 1.0956 1.0970 1.0992 1.0973 1.0999 1.0963 1.0922 1.0650
irintensity: 0.0585 0.1060 1.5395 3.8568 1.8943 1.5148 1.0475 16.5340 6.3358 98.9890 2.8977 14.3612 0.0334 1.8724 3.4709 1.6890 11.1056 5.9899 12.4219 0.0196 0.0020 24.9847 19.5762 1.8294 3.7197 38.1881 7.1018 0.2083 3.1183 8.4268 72.8750 56.1290 121.8435 40.2162 13.1957 16.9696 32.6750 14.6208 3.0497 7.0760 6.0627 25.4126 14.0666 33.7869 12.3080 0.0107 60.6095 35.1808 8.8893 42.9614 23.1507 16.6496 36.4044 17.1668 8.1044 16.9619 18.6791 19.6018 4.2964 24.3235
temp: 298.150 k
press: 1.00000 atm
elementType: 17 8 6 6 6 6 6 6 6 6 6 1 1 1 1 1 1 1 1 1 1 1
symmnumber: 1
zpe: 457790.1 jmol-1
zpe.correction: 0.174363 hartree
zpe.thermalcorrener: 0.186466 hartree
zpe.thermalcorrenthalpy: 0.187410 hartree
zpe.thermalcorrgfe: 0.136009 hartree
zpe.sumelectzpe: -884.024235 hartree
zpe.sumelectthermal: -884.012132 hartree
zpe.sumelectthermalent: -884.011188 hartree
zpe.sumelectthermalfe: -884.062589 hartree
dipole: -2.0602 -1.5268 0.0030
dipole: 2.5643
quadrupole: -68.1221 -68.8824 -75.0947
quadrupole: 8.7316 -0.0047 0.0024
quadrupole: 2.5777 1.8173 -4.3950 8.7316 -0.0047 0.0024
hfenergy: -884.1985979 hartree
pointgroup: C01 [X(C9H11Cl1O1)]
dipole: 0.8951022 0.464693 0.0256265 debye
dipolederiv: -0.6566022 0.2471704 -0.0117789 0.2821478 -0.2860209 0.0050011 -0.0113327 0.0041102 -0.0732633 -1.0949316 0.5571818 -0.0114458 0.5956934 -0.4732392 0.0136668 -0.0110092 0.0125549 -0.4129325 -0.046945 0.0282218 -0.0019006 0.0390929 0.2331593 0.0023423 -0.0016848 0.0019892 0.041628 -0.0287771 0.1395678 0.0033659 0.3232526 -0.1752345 0.0072289 0.0046826 0.0027803 -0.1215979 0.1235244 0.1461616 0.0029182 0.1851698 0.1336569 0.0049838 0.0030347 0.0039056 0.0379013 0.6907467 -0.4848405 0.0167229 -0.5285064 0.0702353 -0.010402 0.0162269 -0.0092543 -0.1813142 0.9949194 -0.5092251 0.0170184 -0.5651156 0.3860428 -0.0110287 0.0166039 -0.0095478 0.0913823 -0.3115284 0.0814304 -0.0016729 -0.065917 -0.0290698 -0.0002058 -0.0029081 0.003351 -0.2095285 0.0559368 0.0964923 0.0009113 0.0619359 -0.1659019 -0.0001574 0.0006223 0.0007618 0.0470394 -0.0110354 -0.0804473 -0.0027853 -0.1130753 0.0019478 -0.0034756 -0.0029286 -0.0026267 0.0802768 -0.1400505 -0.1014482 -0.005094 -0.0542163 0.0856946 -0.0009668 -0.0045531 -0.0020156 0.0525196 0.0770852 -0.0056764 -0.0021216 0.0014102 -0.0649816 -0.0017081 -0.0020121 -0.001855 0.1661191 0.0652547 0.043694 -0.0881745 0.0107581 0.0205845 0.0300485 -0.0678447 0.0775891 -0.0293948 0.0575201 0.0460157 0.0931482 0.011094 0.0222765 -0.0287513 0.0722555 -0.074714 -0.0232803 -0.0944324 -0.1466756 -0.0057494 -0.0678732 0.0479524 -0.0019847 -0.005161 -0.0040011 0.0966675 0.0461742 -0.031403 -0.0117742 -0.0735242 -0.0043723 0.1013243 0.0427456 0.1079854 -0.0293444 0.0479228 -0.0259296 0.0155293 -0.0678299 -0.0017145 -0.1044421 -0.0396245 -0.1089288 -0.0333529 -0.1051737 0.1019364 -0.00446 0.209721 -0.0432059 0.0042858 -0.0036544 0.0014964 0.1034288 -0.0056827 -0.031162 0.0818908 0.002967 0.0700493 -0.0645868 0.1109102 -0.0144879 -0.0275051 0.003015 -0.0306544 -0.0811082 0.0015885 0.0689597 0.0660251 -0.1096401 0.0144592 -0.0350799 0.0769789 0.0965258 -0.0000497 -0.0136246 -0.1460329 -0.0021424 -0.0008381 0.000406 0.1093237 0.2560808 -0.1369357 -0.0033896 -0.1751486 0.2492144 -0.0050549 -0.0038904 -0.0039582 0.3503072 unknown
polarizability: 145.0606486|-2.1609914|125.8447669|2.0122359|0.4661774|58.2595999 unknown
InChI: InChI=1S/C9H11ClO/c1-5-4-8(11)6(2)7(3)9(5)10/h4,11H,1-3H3
charge 0 multiplicity 1
22 atoms
Cl -2.758526 1.284833 -0.043194
O  2.428059 -1.76621 0.054445
C  0.039232 1.148287 0.021028
C  1.287741 0.454514 0.045184
C  -1.189943 -1.028125 -0.024202
C  -1.153833 0.387184 -0.01277
C  1.265599 -0.968923 0.033559
C  0.05375 -1.690907 -0.00029
C  -0.027794 2.666083 0.031235
C  2.600043 1.227745 0.082528
C  -2.486791 -1.811725 -0.059412
H  0.099299 -2.784353 -0.00745
H  -0.558062 3.040152 -0.864083
H  -0.600807 3.026495 0.905605
H  0.969811 3.129687 0.059096
H  2.713459 1.879479 -0.803369
H  2.668886 1.868246 0.981118
H  3.49325 0.574244 0.100687
H  -3.121222 -1.575025 0.81463
H  -3.081206 -1.562657 -0.957839
H  -2.285775 -2.896047 -0.062505
H  3.240429 -1.204777 0.078498
