program: Gaussian 09
title: 000246774
version: EM64L-G09RevD.01
frameworkgroup: C1[X(C9H15NO2)]
method: RPBEPBE
basis: SDD
operation: Freq
keyword: #p
keyword: freq=noraman
keyword: PBEPBE/SDD
title: #p freq=noraman PBEPBE/SDD
converged: YES YES NO NO
title: Mulliken charges:
elementType: O O N C C C C C C C C C H H H H H H H H H H H H H H H
charge: -0.288319 -0.218757 -0.098390 -0.404428 -0.376708 -0.375320 -0.393845 -0.399416 0.210757 -0.613727 0.252780 -0.762314 0.223424 0.193282 0.205503 0.212043 0.203597 0.207175 0.211701 0.268107 0.265784 0.213955 0.252398 0.249643 0.271123 0.248652 0.241297
chargesum: 0.00000
title: Mulliken charges with hydrogens summed into heavy atoms:
elementType: O O N C C C C C C C C C
charge: -0.288319 -0.218757 -0.098390 0.012278 0.040838 0.035453 0.085963 0.080324 0.210757 -0.111686 0.252780 -0.001242
polarizability: 1.30724734e+02 4.90932267e+00 1.10237222e+02 2.98525495e+00 2.55318843e+00 8.39763388e+01
1716.lowfreq: -18.0310 -13.3786 -5.5512 0.0008 0.0009 0.0012 39.8096 57.1190 61.1376
frequency: 39.7566 56.9950 61.0775 71.1112 137.8259 148.6306 168.2459 259.8354 292.6839 344.8096 387.0742 406.2947 423.9722 461.3220 473.7608 520.3671 529.4891 591.1892 654.6305 724.9501 799.8422 807.5609 827.5797 848.6627 890.0400 904.6833 937.3334 946.5862 991.7472 1019.8928 1027.5640 1051.8795 1087.7131 1109.8644 1124.3087 1147.9936 1154.3354 1204.9061 1230.2385 1245.2523 1254.1723 1267.6454 1275.8751 1329.2783 1336.8563 1342.6960 1347.0616 1361.1603 1375.5006 1415.7905 1444.2753 1450.9111 1454.9679 1456.3601 1463.9140 1468.1979 1475.3832 1493.8193 1582.4823 1628.3938 2961.0994 2964.4438 2969.6647 2980.0121 2983.8908 2988.7622 3038.7611 3041.6418 3047.1567 3056.0510 3063.5864 3090.4397 3103.1214 3114.0649 3124.0335
redmass: 3.6048 3.7326 4.0633 6.0470 1.2354 2.8500 2.5732 2.0731 2.8533 3.6626 2.4535 2.1232 2.8658 3.0787 3.2640 2.1347 2.6728 3.2815 3.9298 3.4369 1.5375 3.4490 2.6869 1.4686 2.5064 1.7451 2.9408 1.3354 2.1366 1.9586 1.9237 2.0183 1.4124 1.5630 2.3700 1.6800 1.3869 2.5628 2.2600 1.5082 1.2701 1.5794 1.1835 1.2742 1.3625 1.5477 1.4275 1.3442 1.2497 2.6876 1.0701 1.0668 1.0974 1.0905 1.0866 1.0897 1.0885 1.0904 7.6270 7.5208 1.0708 1.0701 1.0641 1.0379 1.0612 1.0611 1.0959 1.0581 1.1021 1.1031 1.0946 1.0940 1.0939 1.1034 1.1012
irintensity: 3.8119 0.8489 2.6766 8.5870 0.8241 3.2526 4.3164 1.9379 2.6008 6.6590 4.1006 1.5638 1.0597 8.1595 4.1167 1.1825 14.4413 8.7960 1.3654 1.2077 0.0854 0.2833 1.4995 17.8365 11.4924 11.9132 0.8782 5.7287 26.0025 7.0027 5.1623 1.5246 0.4870 28.9726 10.1680 13.8363 8.6093 295.5535 8.1591 55.1093 3.9308 20.0845 13.8300 0.0611 1.2554 6.8073 4.0296 7.3221 83.2224 71.1519 30.3980 19.3925 18.8661 7.4446 14.1089 22.8295 15.7280 10.1580 352.6238 92.3902 12.4072 48.2241 41.2836 3.2768 32.2745 31.7542 55.4213 5.5733 32.6170 79.2491 5.2797 7.2159 4.7370 11.3355 8.8341
temp: 298.150 k
press: 1.00000 atm
elementType: 8 8 7 6 6 6 6 6 6 6 6 6 1 1 1 1 1 1 1 1 1 1 1 1 1 1 1
symmnumber: 1
zpe: 603297.6 jmol-1
zpe.correction: 0.229784 hartree
zpe.thermalcorrener: 0.242251 hartree
zpe.thermalcorrenthalpy: 0.243196 hartree
zpe.thermalcorrgfe: 0.190024 hartree
zpe.sumelectzpe: -556.220686 hartree
zpe.sumelectthermal: -556.208218 hartree
zpe.sumelectthermalent: -556.207274 hartree
zpe.sumelectthermalfe: -556.260446 hartree
dipole: -2.0817 -0.8932 0.2959
dipole: 2.2845
quadrupole: -64.6789 -85.7273 -70.1075
quadrupole: 4.2915 2.9027 -3.5081
quadrupole: 8.8257 -12.2227 3.3970 4.2915 2.9027 -3.5081
hfenergy: -556.4504696 hartree
pointgroup: C01 [X(C9H15N1O2)]
dipole: 0.8378655 0.2698547 -0.1816328 debye
polarizability: 130.0209497|-1.8498686|96.6567629|-8.2646615|-12.761625|98.2605826 unknown
InChI: InChI=1S/C9H15NO2/c1-8(11)7-9(12)10-5-3-2-4-6-10/h2-7H2,1H3
charge 0 multiplicity 1
27 atoms
O  -0.61252 -1.135275 1.95145
O  -2.242689 1.550433 -1.093248
N  0.708492 -0.156181 0.297288
C  3.495662 0.334504 -0.448213
C  3.111249 -0.742947 0.594475
C  2.437057 1.462174 -0.482462
C  1.682489 -1.27566 0.343958
C  1.022334 0.881473 -0.713912
C  -0.376606 -0.166963 1.157979
C  -1.344226 1.041663 1.119078
C  -2.35742 0.885295 -0.027958
C  -3.470325 -0.121649 0.201925
H  4.495646 0.750014 -0.22314
H  3.561024 -0.134623 -1.452199
H  3.823086 -1.589618 0.559852
H  3.160341 -0.312518 1.613623
H  2.451058 2.016817 0.476708
H  2.664286 2.18698 -1.287275
H  1.646991 -1.81504 -0.625947
H  1.355805 -1.966443 1.137265
H  0.253303 1.667083 -0.714359
H  0.983918 0.405211 -1.716706
H  -0.81731 2.00258 1.010664
H  -1.86864 1.016044 2.088209
H  -3.076833 -1.027777 0.697557
H  -3.966595 -0.376531 -0.747132
H  -4.222075 0.315353 0.888621
