program: Gaussian 09
title: 000246765
version: EM64L-G09RevD.01
frameworkgroup: C1[X(C11H14N2O2)]
method: RPBEPBE
basis: SDD
operation: Freq
keyword: #p
keyword: freq=noraman
keyword: PBEPBE/SDD
title: #p freq=noraman PBEPBE/SDD
converged: YES YES NO NO
title: Mulliken charges:
elementType: O O N N C C C C C C C C C C C H H H H H H H H H H H H H H
charge: -0.175582 -0.203490 -0.353128 0.006265 0.345431 -0.482249 -0.469496 -0.225487 -0.586448 -0.420680 -0.419424 -0.390398 0.120880 0.125809 -0.191469 0.240547 0.199367 0.217730 0.234537 0.290693 0.268211 0.256093 0.210885 0.209324 0.205803 0.214305 0.212093 0.200529 0.359348
chargesum: 0.00000
title: Mulliken charges with hydrogens summed into heavy atoms:
elementType: O O N N C C C C C C C C C C C
charge: -0.175582 -0.203490 0.006220 0.006265 0.345431 -0.042335 -0.017229 0.065206 -0.062144 -0.000471 0.000684 0.022224 0.120880 0.125809 -0.191469
polarizability: 1.31006725e+02 -3.30976813e+00 1.47822299e+02 -5.73435480e+00 3.54293714e+00 9.87431453e+01
1716.lowfreq: -17.2431 -0.0010 -0.0004 0.0003 7.1708 14.4820 45.4647 81.5212 108.4685
frequency: 45.4501 81.4951 108.4487 130.4371 141.2110 156.0268 211.6677 254.3177 272.8903 309.4076 332.9933 364.8953 385.5449 398.3355 435.9530 443.3788 471.1521 501.7112 516.1966 559.3646 586.7811 653.3302 676.3155 747.9065 788.7168 803.7469 819.4783 846.5373 851.8786 871.3877 913.0197 935.3933 936.1571 969.0541 991.6781 1032.0286 1054.5991 1072.5305 1081.1967 1108.1078 1134.0849 1157.4446 1172.0148 1195.0097 1229.8927 1245.6705 1259.3267 1272.4809 1278.8556 1303.2512 1313.0851 1321.6218 1332.6097 1338.6924 1346.4902 1355.0969 1361.5689 1378.3182 1444.4086 1462.4717 1466.1792 1477.0191 1478.6550 1485.9108 1641.2400 1644.9147 2208.9058 2945.5668 2965.0663 2973.9778 2974.7198 2976.1453 2978.4368 2981.5433 3023.9176 3030.4591 3037.3950 3040.4410 3050.7905 3090.3498 3481.3513
redmass: 11.6554 4.2896 4.8147 4.9997 4.8576 5.4163 2.8723 2.5239 3.2207 3.5482 4.5394 2.3560 3.4565 4.3338 4.8079 3.9938 3.7015 2.3512 3.2067 3.3210 4.5303 3.3294 5.5984 2.9724 1.4931 1.4433 2.6415 2.0414 2.4808 2.4391 2.8123 1.6177 2.1568 2.5913 1.9992 2.7145 2.1349 1.9284 2.1135 1.9058 1.4565 1.4063 1.8417 1.4265 1.8701 1.7407 1.3587 1.4808 1.6008 2.0149 2.1208 2.0132 1.3702 1.3695 1.4796 1.4145 1.4607 1.7822 1.0800 1.0839 1.0885 1.0814 1.0862 1.0895 10.2974 6.0074 12.5786 1.0798 1.0599 1.0608 1.0659 1.0646 1.0658 1.0644 1.0990 1.1002 1.0950 1.1013 1.1033 1.0904 1.0761
irintensity: 1.1268 0.2445 6.6120 5.3352 2.1625 1.6408 0.2368 0.5942 0.6064 2.4119 10.5388 2.8463 3.9382 7.6732 3.2912 3.0442 2.4306 1.5887 6.4448 2.6524 3.3168 0.4542 15.4298 10.4491 4.4800 92.1501 7.9567 8.7606 2.5315 3.1632 2.0050 10.7993 0.7863 7.8304 1.0878 3.7034 2.0432 1.8421 10.5260 0.0073 0.9866 2.5138 8.6182 31.4412 115.0584 41.8114 6.3487 44.3358 61.9637 35.5702 56.0148 29.1069 0.9385 0.1427 1.3787 11.5747 3.8392 7.0059 12.1684 8.6228 5.6685 17.3049 5.7443 7.7052 173.7634 396.0866 3.9095 4.0414 28.8768 23.5391 28.6743 12.0435 20.7720 25.1358 43.4788 20.6816 56.2739 13.8075 83.3164 5.9533 47.6578
temp: 298.150 k
press: 1.00000 atm
elementType: 8 8 7 7 6 6 6 6 6 6 6 6 6 6 6 1 1 1 1 1 1 1 1 1 1 1 1 1 1
symmnumber: 1
zpe: 620360.0 jmol-1
zpe.correction: 0.236283 hartree
zpe.thermalcorrener: 0.249653 hartree
zpe.thermalcorrenthalpy: 0.250597 hartree
zpe.thermalcorrgfe: 0.196625 hartree
zpe.sumelectzpe: -686.413119 hartree
zpe.sumelectthermal: -686.399748 hartree
zpe.sumelectthermalent: -686.398804 hartree
zpe.sumelectthermalfe: -686.452777 hartree
dipole: 3.2407 -2.5266 -1.8958
dipole: 4.5254
quadrupole: -90.5066 -118.6270 -83.8880
quadrupole: 3.0546 2.6009 -3.3338
quadrupole: 7.1673 -20.9531 13.7859 3.0546 2.6009 -3.3338
hfenergy: -686.6494014 hartree
pointgroup: C01 [X(C11H14N2O2)]
dipole: 1.347551 0.8841333 0.7565747 debye
polarizability: 131.5742285|4.6509858|147.1553338|6.2887437|3.040691|98.8426066 unknown
InChI: InChI=1S/C11H14N2O2/c12-7-8-10(15)13-9(14)6-11(8)4-2-1-3-5-11/h8,13H,1-6H2
charge 0 multiplicity 1
29 atoms
O  -3.074726 -0.865311 -0.577235
O  -1.178826 3.307842 0.069293
N  -2.083159 1.192522 -0.18619
N  -0.622407 -3.417637 -0.116052
C  0.466671 -0.040186 0.319747
C  1.605288 -0.681735 1.167842
C  0.864738 -0.0623 -1.187741
C  -0.867524 -0.850318 0.553472
C  0.183286 1.404207 0.821994
C  2.986918 -0.033165 0.912449
C  2.250095 0.575442 -1.454519
C  3.352185 -0.079964 -0.589698
C  -2.100719 -0.213687 -0.132128
C  -1.042901 2.066165 0.210951
C  -0.753058 -2.269109 0.173183
H  1.671642 -1.758104 0.91226
H  1.347112 -0.62327 2.245335
H  0.09338 0.443622 -1.801368
H  0.892388 -1.118552 -1.522341
H  -1.078975 -0.822458 1.646344
H  1.033587 2.076617 0.628346
H  0.040632 1.393994 1.923117
H  3.751837 -0.56574 1.508492
H  2.992823 1.017875 1.264715
H  2.217976 1.665484 -1.255364
H  2.49327 0.4660 -2.528277
H  4.32238 0.422719 -0.763298
H  3.477531 -1.137513 -0.900243
H  -2.913841 1.636159 -0.599387
