program: Gaussian 09
title: 000246759
version: EM64L-G09RevD.01
frameworkgroup: C1[X(C10H23NO3)]
method: RPBEPBE
basis: SDD
operation: Freq
keyword: #p
keyword: freq=noraman
keyword: PBEPBE/SDD
title: #p freq=noraman PBEPBE/SDD
converged: YES YES NO NO
title: Mulliken charges:
elementType: O O O N C C C C C C C C C C H H H H H H H H H H H H H H H H H H H H H H H
charge: -0.456032 -0.452451 -0.452255 -0.114712 -0.365926 -0.372524 -0.380017 -0.372261 -0.357204 -0.350095 -0.350144 -0.330937 -0.342385 -0.342378 0.191256 0.204614 0.190177 0.206392 0.189375 0.206909 0.189333 0.204479 0.217806 0.221409 0.209055 0.211258 0.209735 0.211696 0.204126 0.191535 0.188663 0.188169 0.188749 0.187712 0.344800 0.340985 0.341089
chargesum: 0.00000
title: Mulliken charges with hydrogens summed into heavy atoms:
elementType: O O O N C C C C C C C C C C
charge: -0.111232 -0.111466 -0.111166 -0.114712 0.029944 0.024045 0.016267 0.021551 0.082010 0.070218 0.071286 0.064724 0.034447 0.034083
polarizability: 1.49922970e+02 -7.67767668e-01 1.32873991e+02 9.16442762e-01 -7.28025822e-01 1.06891362e+02
1716.lowfreq: -12.3432 -0.0006 -0.0003 0.0004 1.4568 7.3887 24.7119 34.0301 38.6838
frequency: 24.3670 33.9547 38.6674 44.4738 50.6267 81.0911 86.0083 96.5605 113.7000 125.8088 130.2326 138.9009 198.7387 233.2793 250.5844 259.5913 275.1290 278.5977 279.3095 307.0595 356.9019 392.1351 431.9713 462.5765 523.4976 541.6778 753.7939 754.8169 803.6107 808.5736 812.7368 838.8421 921.0624 922.3852 960.7329 964.6106 971.5322 997.4050 1002.6739 1017.8125 1040.2883 1049.0861 1058.0006 1068.3513 1080.7265 1087.3843 1119.8198 1148.2766 1150.4070 1174.3137 1200.4065 1203.4201 1209.9299 1221.9209 1237.9445 1256.9513 1260.3705 1271.9419 1277.1166 1278.9222 1282.2147 1288.9014 1299.6757 1302.8193 1342.6153 1343.4378 1349.7712 1372.0055 1379.4780 1411.4424 1413.8376 1415.1486 1465.9659 1467.7244 1468.9668 1470.3550 1473.2382 1478.5855 1481.5978 1485.8042 1490.8208 1491.6510 2852.5836 2861.6771 2913.9277 2926.6862 2927.2847 2946.4439 2972.8335 2973.8528 2974.0789 2974.3706 2989.4997 2989.7434 3005.0439 3012.4170 3014.1625 3029.7871 3033.1294 3056.1343 3059.6843 3059.8222 3564.8045 3565.1770 3576.0629
redmass: 5.4737 3.4525 4.2017 2.3537 1.8672 2.2955 3.3904 2.9597 2.6807 2.6481 2.3105 2.8529 3.0816 3.5803 1.2470 2.1294 1.1395 1.8710 1.3283 3.9562 3.5822 3.3861 3.3268 3.7503 3.3496 3.2645 1.0864 1.0847 1.2215 1.1673 1.1710 3.4241 1.2828 1.2612 6.6957 7.1187 7.2075 2.7318 2.4840 2.3445 2.6678 3.7576 2.5271 2.1432 2.3273 2.1845 1.6467 1.4187 1.4027 1.1966 1.3400 1.2697 1.2740 1.6273 1.5658 1.2682 1.2739 1.2906 1.2329 1.0797 1.1214 1.1596 1.2041 1.2350 1.4332 1.4437 1.3470 1.4129 1.4421 1.4588 1.4412 1.4391 1.0708 1.0710 1.0793 1.0838 1.0803 1.0897 1.0843 1.0848 1.0924 1.0931 1.0710 1.0707 1.0699 1.0545 1.0545 1.0569 1.0613 1.1063 1.1025 1.0629 1.0592 1.0592 1.1031 1.0887 1.0901 1.0989 1.0978 1.0971 1.1016 1.1035 1.0664 1.0664 1.0666
irintensity: 0.0993 1.5193 0.4068 5.7346 7.4471 4.2979 4.1678 3.9746 9.1904 7.8886 2.6494 1.7102 3.6686 3.8862 104.4992 45.7045 138.8078 85.7170 98.7562 3.9220 5.9261 20.6607 6.6443 9.5911 8.9904 27.7992 8.4985 7.0940 2.4283 0.1774 2.4066 19.8762 7.3343 1.5763 81.5105 60.7845 63.2835 42.0021 14.2184 36.4330 17.2083 3.3582 41.3253 9.2749 13.4792 26.9364 7.1370 4.2330 1.9572 5.4189 28.0232 32.5682 29.4562 4.5431 5.8400 9.9601 8.3135 6.7481 11.4331 2.2402 9.3293 12.5187 10.6280 24.3158 1.9308 3.0269 0.1876 9.0430 4.0326 0.0645 8.4315 6.4683 0.8147 0.8111 0.0872 0.7072 4.3521 6.3725 3.7330 7.8778 11.1394 8.6410 40.1380 124.6583 68.7897 61.0041 65.8221 68.8930 15.7884 51.6336 44.2848 27.7033 36.0716 54.4494 46.6261 16.7749 9.8773 4.8701 14.7902 37.2577 115.0052 117.5132 1.9831 1.9882 3.3958
temp: 298.150 k
press: 1.00000 atm
elementType: 8 8 8 7 6 6 6 6 6 6 6 6 6 6 1 1 1 1 1 1 1 1 1 1 1 1 1 1 1 1 1 1 1 1 1 1 1
symmnumber: 1
zpe: 854952.4 jmol-1
zpe.correction: 0.325634 hartree
zpe.thermalcorrener: 0.344549 hartree
zpe.thermalcorrenthalpy: 0.345494 hartree
zpe.thermalcorrgfe: 0.275292 hartree
zpe.sumelectzpe: -674.028945 hartree
zpe.sumelectthermal: -674.010030 hartree
zpe.sumelectthermalent: -674.009086 hartree
zpe.sumelectthermalfe: -674.079288 hartree
dipole: -0.2130 -0.3166 -3.8635
dipole: 3.8823
quadrupole: -88.3640 -87.9453 -85.7740
quadrupole: -3.8393 0.4745 0.1122
quadrupole: -1.0029 -0.5842 1.5871 -3.8393 0.4745 0.1122
hfenergy: -674.3545792 hartree
pointgroup: C01 [X(C10H23N1O3)]
dipole: -0.0794728 0.1184102 1.5207506 debye
polarizability: 149.8849692|1.0467751|132.9081321|-1.0803844|-0.6657675|106.8952218 unknown
InChI: InChI=1S/C10H23NO3/c12-8-3-1-5-11(7-10-14)6-2-4-9-13/h12-14H,1-10H2
charge 0 multiplicity 1
37 atoms
O  -0.369288 -4.515685 0.221792
O  -5.324857 2.464297 0.010982
O  5.570851 2.128111 0.017394
N  0.025522 -0.823839 -0.237552
C  -0.9572 0.18781 -0.701393
C  1.419498 -0.532185 -0.662018
C  -2.177798 0.315354 0.234848
C  2.107869 0.535304 0.215403
C  -0.388011 -2.222154 -0.513127
C  -3.214447 1.330126 -0.297432
C  3.532621 0.866849 -0.282581
C  0.027593 -3.155807 0.631571
C  -4.42427 1.473624 0.628691
C  4.233935 1.904198 0.597201
H  -1.310631 -0.029191 -1.741785
H  -0.44723 1.168758 -0.745455
H  1.463325 -0.214498 -1.734907
H  2.003378 -1.470128 -0.593951
H  -2.658025 -0.676958 0.357182
H  -1.816915 0.615938 1.238036
H  1.494364 1.45896 0.229487
H  2.136727 0.162886 1.258345
H  0.03593 -2.613577 -1.467166
H  -1.486944 -2.270195 -0.611679
H  -2.746664 2.326874 -0.419102
H  -3.574058 1.020242 -1.298116
H  4.153364 -0.050354 -0.305354
H  3.494921 1.253985 -1.319615
H  -0.486046 -2.844197 1.564081
H  1.124719 -3.097027 0.797647
H  -4.095752 1.813623 1.635637
H  -4.935209 0.491891 0.741724
H  4.314532 1.526952 1.640598
H  3.647056 2.849198 0.612672
H  -0.144051 -5.155891 0.941863
H  -6.129507 2.576343 0.577233
H  6.057294 2.799259 0.55925
