program: Gaussian 09
title: 000246741
version: EM64L-G09RevD.01
frameworkgroup: C1[X(C10H10N2O2)]
method: RPBEPBE
basis: SDD
operation: Freq
keyword: #p
keyword: freq=noraman
keyword: PBEPBE/SDD
title: #p freq=noraman PBEPBE/SDD
converged: YES YES NO NO
title: Mulliken charges:
elementType: O O N N C C C C C C C C C C H H H H H H H H H H
charge: -0.199903 -0.211350 -0.044854 -0.624298 -0.334041 -0.571912 0.478789 0.169216 0.206686 -0.378069 -0.457494 -0.232247 -0.216046 -0.240872 0.294877 0.260279 0.223794 0.289800 0.224521 0.332974 0.340181 0.231147 0.227508 0.231315
chargesum: 0.00000
title: Mulliken charges with hydrogens summed into heavy atoms:
elementType: O O N N C C C C C C C C C C
charge: -0.199903 -0.211350 -0.044854 0.048856 -0.039164 -0.087840 0.478789 0.169216 0.206686 -0.088269 -0.232973 -0.001100 0.011462 -0.009557
polarizability: 1.57962541e+02 -2.31456208e+00 1.36204033e+02 -1.04095353e+01 4.58289834e+00 6.56586129e+01
1716.lowfreq: -7.4718 -5.5323 -0.0009 -0.0007 -0.0004 1.4259 33.3600 41.8073 66.9285
frequency: 33.0721 41.7942 66.9256 106.6562 180.5414 205.2547 233.1496 260.7170 309.6839 346.2063 351.3751 404.9660 462.6652 488.1721 512.5281 551.5953 569.1408 605.0492 616.2859 655.9482 705.8110 709.2769 754.7333 786.8161 799.9773 813.1173 861.0786 901.6677 939.4186 949.4723 984.4521 989.3596 1005.1156 1015.8910 1028.2585 1053.1282 1085.9035 1110.5983 1163.0165 1173.7400 1194.7989 1208.5252 1219.4109 1254.8986 1313.8273 1342.3608 1381.8901 1427.8917 1441.8328 1464.3460 1485.8552 1563.7540 1592.3829 1614.7474 1629.0679 1695.3399 2993.6598 3011.4807 3048.9402 3110.5480 3124.5701 3134.2401 3145.9577 3163.4258 3551.4542 3698.2230
redmass: 4.2183 5.1198 6.8962 5.4998 4.6568 5.3449 2.8939 3.6442 2.5313 3.4888 1.5683 2.8524 2.8378 3.0114 1.6146 6.0090 4.9868 5.3410 6.4615 4.9342 8.9240 2.0603 1.6786 4.0699 6.0224 4.7316 1.2487 2.1285 1.9623 2.6595 1.3663 6.1797 1.3642 3.3604 2.2861 2.0120 1.6051 3.5108 1.1872 1.0564 1.1676 1.5269 1.8784 1.3650 1.4349 1.2803 6.6983 5.0057 2.1615 1.1191 2.2309 4.3560 5.9528 5.8574 1.3241 12.2329 1.0618 1.0809 1.1018 1.0879 1.0874 1.0915 1.0958 1.1014 1.0458 1.1039
irintensity: 2.0271 3.9372 3.3968 1.1569 0.5721 11.6779 16.2687 6.9686 11.4887 1.2512 80.6678 0.1636 7.1385 62.7032 143.3093 4.5960 10.5199 8.9717 0.5896 9.8068 4.0953 47.8896 48.6757 11.4265 45.9182 16.9875 0.2514 19.3683 3.6496 23.8464 0.1196 0.4618 1.5473 42.2046 12.1179 1.5379 10.1223 83.4824 2.4535 0.0931 1.5934 10.0266 9.0849 17.8302 9.2814 2.4395 0.0913 28.1971 13.4192 11.6674 24.1117 114.8133 1.4163 9.5387 243.1038 171.2218 14.1476 3.8640 9.1949 12.0854 3.5395 8.1943 23.6392 31.3916 67.1567 45.9652
temp: 298.150 k
press: 1.00000 atm
elementType: 8 8 7 7 6 6 6 6 6 6 6 6 6 6 1 1 1 1 1 1 1 1 1 1
symmnumber: 1
zpe: 482370.1 jmol-1
zpe.correction: 0.183725 hartree
zpe.thermalcorrener: 0.196058 hartree
zpe.thermalcorrenthalpy: 0.197003 hartree
zpe.thermalcorrgfe: 0.143862 hartree
zpe.sumelectzpe: -645.967423 hartree
zpe.sumelectthermal: -645.955090 hartree
zpe.sumelectthermalent: -645.954146 hartree
zpe.sumelectthermalfe: -646.007286 hartree
dipole: 3.2276 6.2265 -1.1669
dipole: 7.1098
quadrupole: -91.3313 -75.7328 -82.3071
quadrupole: -12.3724 0.1776 0.4550
quadrupole: -8.2076 7.3909 0.8167 -12.3724 0.1776 0.4550
hfenergy: -646.1511484 hartree
pointgroup: C01 [X(C10H10N2O2)]
dipole: 1.1061499 -2.4332465 0.8246835 debye
dipolederiv: -0.9177719 -0.7349236 0.1760512 0.0631292 -0.3690967 0.0513229 -0.0959186 0.0088409 -0.1668546 -0.7938705 -0.3348227 0.0734707 -0.2805582 -0.9564716 0.1474185 0.0485123 0.1585052 -0.3404582 -0.1785487 0.6855019 -0.1742325 -0.0379142 -0.0622151 -0.0341127 -0.0340592 0.0214706 -0.2098323 -0.264458 -0.0162697 0.0891213 0.0389867 -1.1914321 0.1557409 0.1196286 0.1303856 -0.6886196 -0.3462863 0.041785 -0.0344788 0.1203579 -0.307051 0.1287784 -0.031256 0.1320406 0.1533616 0.2152485 -0.0488546 -0.0350781 -0.0173611 0.1304881 0.0223531 -0.1514388 0.0039024 0.1160439 0.2671717 -0.0047197 0.1023405 0.0592211 -0.0383031 -0.0099563 0.1891953 -0.0133373 -0.0413606 0.3057849 -0.2014572 0.0662791 0.1021967 1.2088956 -0.3348502 0.053968 -0.3461753 0.1892882 1.3659733 0.6449656 -0.0971361 0.0605275 1.0249505 -0.2219393 0.1282523 -0.2032205 0.2485861 -0.1697668 -0.0486135 0.0059627 -0.1020559 -0.0461038 -0.0031067 -0.0085767 -0.013658 -0.1389083 -0.1693897 0.0442676 0.0286191 0.0182478 0.0592024 0.0419884 0.0201185 0.0518136 -0.1545259 -0.0302488 0.0519145 0.0415439 0.0805294 0.1319104 0.0390985 0.0447917 0.0380004 -0.1327817 0.0055825 -0.0812075 0.0440163 -0.0891912 0.0648196 -0.0091985 0.019091 -0.0028112 -0.1324177 0.0562274 0.0196433 0.0767516 0.0230804 -0.0796806 0.014222 0.0673191 0.0147694 -0.1418153 0.1401138 -0.0087525 -0.0365349 -0.0204792 0.0711664 -0.0066246 -0.0429006 0.0011909 -0.0065422 -0.0372974 0.0095316 -0.0562272 0.0158759 0.0680051 0.078682 -0.0283 0.0237536 -0.0456022 0.0252264 0.0077013 -0.0002257 -0.0451305 -0.1230116 -0.0393616 0.0186334 0.0084917 0.0813965 0.1687652 0.05802 -0.0221621 0.0363516 0.0513545 -0.001814 -0.0130399 0.0061122 0.1389341 0.0552642 -0.0991354 -0.0402715 -0.0714917 -0.0821398 -0.0459907 -0.0326923 -0.0476336 0.1314381 0.1853923 -0.028843 -0.0294819 0.0058478 0.2490693 0.0274946 -0.0873376 0.0225668 0.3561713 0.1784939 0.0248449 -0.0334695 0.027504 0.237956 0.0472185 -0.0283126 0.0493022 0.3580824 0.0547763 -0.0550273 -0.0329383 -0.0776097 -0.0840761 -0.0426632 -0.0360006 -0.0392321 0.140497 -0.0057506 0.0996446 -0.0320853 0.1147086 -0.0454595 0.0112364 -0.0355438 0.0100054 0.1488923 -0.1106317 -0.0251936 -0.0798344 -0.0247728 0.0872231 -0.0159363 -0.0841333 -0.0150834 0.1370272 unknown
polarizability: 157.2466183|2.7007687|135.8606943|13.8083515|-5.1167445|66.7178742 unknown
InChI: InChI=1S/C10H10N2O2/c11-9-8(10(13)14-12-9)6-7-4-2-1-3-5-7/h1-5,8H,6,11H2
charge 0 multiplicity 1
24 atoms
O  -3.18789 1.271638 -0.487005
O  -1.146932 2.385805 -0.621355
N  -3.66688 -0.123972 -0.139566
N  -2.612818 -2.139245 0.514479
C  -1.264139 -0.033007 0.091111
C  -0.176707 -0.641991 -0.861823
C  1.259183 -0.415643 -0.39766
C  -2.561155 -0.810546 0.164785
C  -1.777087 1.346457 -0.363446
C  1.747396 0.88967 -0.122123
C  2.137176 -1.519237 -0.250423
C  3.083186 1.077885 0.296649
C  3.475409 -1.330201 0.165979
C  3.952067 -0.029134 0.442959
H  -0.826611 0.073811 1.102563
H  -0.325104 -0.219531 -1.873718
H  -0.362406 -1.728291 -0.951187
H  1.083325 1.753273 -0.247596
H  1.776156 -2.532803 -0.468711
H  -1.781917 -2.627233 0.835379
H  -3.511427 -2.617716 0.545474
H  3.447557 2.090509 0.503194
H  4.141283 -2.193971 0.273134
H  4.988236 0.121071 0.766005
