program: Gaussian 09
title: 000246716
version: EM64L-G09RevD.01
frameworkgroup: C1[X(C9H18N3PS)]
method: RPBEPBE
basis: SDD
operation: Freq
keyword: #p
keyword: freq=noraman
keyword: PBEPBE/SDD
title: #p freq=noraman PBEPBE/SDD
converged: YES YES NO NO
title: Mulliken charges:
elementType: S P N N N C C C C C C C C C H H H H H H H H H H H H H H H H H H
charge: -0.303007 0.664577 -0.350552 -0.350085 -0.448689 -0.385058 -0.393671 -0.385005 -0.391513 -0.355159 -0.325632 -0.355484 -0.369195 -0.400341 0.250849 0.248435 0.247547 0.261367 0.248132 0.251328 0.261274 0.248886 0.202091 0.251093 0.262169 0.205431 0.198564 0.201329 0.207547 0.197484 0.217303 0.187984
chargesum: 0.00000
title: Mulliken charges with hydrogens summed into heavy atoms:
elementType: S P N N N C C C C C C C C C
charge: -0.303007 0.664577 -0.350552 -0.350085 -0.448689 0.114225 0.115242 0.114455 0.118647 0.098025 0.141968 0.044409 0.035837 0.004946
polarizability: 1.71418956e+02 2.81880366e-01 1.46388283e+02 -6.34134084e-01 -1.70351264e-01 1.47382698e+02
1716.lowfreq: -23.2029 -16.3584 -3.7299 0.0012 0.0016 0.0027 13.7451 34.7835 45.0947
frequency: -20.1828 31.9653 44.5216 64.3131 111.3314 120.6505 136.4303 152.4799 164.2838 217.5540 236.5515 279.0265 299.5846 343.0379 348.5683 356.8848 381.2562 396.0090 439.6269 457.5567 533.8441 571.8577 608.2107 680.0215 790.8042 801.5017 802.6321 804.5513 811.5992 825.0207 843.0595 879.8458 893.8836 897.6615 945.2322 950.2589 990.6058 998.9896 1021.2843 1054.7391 1068.1023 1077.7672 1082.1591 1113.1282 1116.4056 1120.2589 1125.1427 1125.6715 1148.2738 1152.1907 1153.7231 1156.8746 1220.6013 1231.0599 1237.5918 1252.9592 1275.4094 1323.7085 1331.3289 1334.6609 1345.2253 1353.0812 1373.2483 1439.2734 1442.9846 1450.9257 1455.6445 1458.7111 1460.2592 1460.5780 1464.5339 1474.1466 2934.2056 2941.2094 2964.2652 2981.0294 2983.1573 3031.9752 3041.9623 3047.3631 3052.7744 3063.2706 3064.7628 3067.8230 3070.3748 3080.5861 3177.3928 3178.5411 3193.7784 3194.9484
redmass: 3.4399 3.5037 3.0882 3.4272 3.6337 5.1933 3.3843 4.5828 3.7118 2.4925 2.2985 3.7856 3.6713 4.6393 3.6549 3.3368 1.8474 5.9365 2.9412 3.5416 1.9978 9.6656 9.8509 4.0608 8.8728 2.3084 1.1586 2.6207 1.1168 2.7023 1.5167 4.2712 3.5133 2.9436 1.3468 2.7499 1.0659 1.0725 2.2684 2.0555 1.2505 1.2843 1.4401 1.3284 1.2890 1.3318 1.2962 2.8880 1.3776 1.2257 1.3541 2.2678 2.3050 3.3879 3.4508 1.2509 1.1501 1.5261 1.3196 1.3726 1.3099 1.3376 1.3680 1.0775 1.0747 1.0910 1.1700 1.1436 1.0920 1.0986 1.0839 1.0873 1.0682 1.0699 1.0636 1.0610 1.0608 1.0960 1.0993 1.0978 1.1026 1.0499 1.0498 1.0613 1.0613 1.0938 1.1161 1.1164 1.1163 1.1165
irintensity: 0.3850 0.1561 1.3046 2.4047 0.7739 2.6476 1.0659 9.5484 7.9910 1.3067 2.9830 2.4227 2.3176 1.0458 1.0268 2.1375 5.9264 2.4505 0.4117 14.7000 10.1324 58.0416 88.5275 42.5110 2.2237 7.8825 40.3771 8.5384 28.2120 3.9495 15.2590 149.6966 66.7179 17.8191 9.9985 119.8820 0.5146 5.1571 4.2799 70.6938 2.1387 21.7664 6.0032 1.9812 5.4060 10.2934 8.0263 14.8273 0.0714 0.7572 0.4308 39.3743 39.6346 55.9137 24.8999 0.4210 15.1110 2.9001 0.8998 0.7626 2.3706 0.9150 11.3345 8.5686 10.3973 6.6307 0.5226 3.0364 14.0229 13.3674 16.0522 7.7718 50.4113 66.3161 45.5504 31.1775 34.3432 66.6106 38.6154 12.8648 79.4289 6.8806 15.2964 47.3049 25.5888 8.8243 0.4282 2.0222 8.3390 14.8815
temp: 298.150 k
press: 1.00000 atm
elementType: 16 15 7 7 7 6 6 6 6 6 6 6 6 6 1 1 1 1 1 1 1 1 1 1 1 1 1 1 1 1 1 1
symmnumber: 1
zpe: 700905.7 jmol-1
zpe.correction: 0.266961 hartree
zpe.thermalcorrener: 0.281852 hartree
zpe.thermalcorrenthalpy: 0.282796 hartree
zpe.thermalcorrgfe: 0.224267 hartree
zpe.sumelectzpe: -1256.086013 hartree
zpe.sumelectthermal: -1256.071122 hartree
zpe.sumelectthermalent: -1256.070178 hartree
zpe.sumelectthermalfe: -1256.128707 hartree
dipole: 0.8412 0.0068 -1.9237
dipole: 2.0996
quadrupole: -91.8264 -92.3834 -108.7709
quadrupole: -0.2967 5.8120 -0.3471
quadrupole: 5.8338 5.2769 -11.1107 -0.2967 5.8120 -0.3471
hfenergy: -1256.3529743 hartree
pointgroup: C01 [X(C9H18N3P1S1)]
dipole: -0.3280384 -0.34264 0.6762718 debye
polarizability: 170.8694992|-2.8742433|146.8315274|-2.3742546|-0.0712301|147.4889104 unknown
InChI: InChI=1S/C9H18N3PS/c14-13(11-6-7-11,12-8-9-12)10-4-2-1-3-5-10/h1-9H2
charge 0 multiplicity 1
32 atoms
S  1.61828 1.031386 -2.051018
P  0.848505 0.018389 -0.376126
N  1.122343 0.781561 1.233963
N  1.54757 -1.600109 -0.000097
N  -0.846874 -0.26224 -0.410497
C  2.439362 1.497708 1.46767
C  1.163978 2.296162 1.276644
C  3.021278 -1.823456 -0.284495
C  1.971297 -2.456148 -1.177668
C  -1.719551 0.171657 -1.518863
C  -1.520225 -0.980182 0.698645
C  -2.876954 1.047228 -0.985244
C  -2.674778 -0.125447 1.269099
C  -3.642788 0.317989 0.145454
H  3.160049 1.52608 0.639159
H  2.857706 1.349296 2.467495
H  0.651416 2.731207 2.139491
H  1.058445 2.835027 0.325277
H  3.537071 -2.419306 0.474167
H  3.590336 -0.989849 -0.717824
H  1.858827 -2.030768 -2.183965
H  1.719906 -3.515129 -1.06902
H  -2.137751 -0.726768 -2.024694
H  -1.106815 0.720047 -2.256769
H  -0.77681 -1.213248 1.478346
H  -1.92081 -1.942237 0.310608
H  -3.560218 1.296967 -1.820257
H  -2.457646 1.997665 -0.600469
H  -2.242106 0.764728 1.765889
H  -3.215206 -0.709432 2.039682
H  -4.437108 0.969963 0.555946
H  -4.148631 -0.57664 -0.275326
