program: Gaussian 09
title: 000246701
version: EM64L-G09RevD.01
frameworkgroup: C1[X(C16H18O2)]
method: RPBEPBE
basis: SDD
operation: Freq
keyword: #pfreq=noraman
keyword: PBEPBE/SDD
title: #p freq=noraman PBEPBE/SDD
converged: YES YES NO NO
title: Mulliken charges:
elementType: O O C C C C C C C C C C C C C C C C H H H H H H H H H H H H H H H H H H
charge: -0.442952 -0.460976 0.186973 0.191642 0.238014 0.339287 -0.390900 -0.375135 -0.574919 -0.542623 0.446725 0.447535 -0.387271 -0.428425 -0.527636 -0.552576 -0.812730 -0.813831 0.308251 0.294398 0.234229 0.234751 0.231528 0.233428 0.209037 0.241048 0.205140 0.219451 0.223556 0.232720 0.229092 0.224529 0.223291 0.236805 0.337374 0.341170
chargesum: 0.00000
title: Mulliken charges with hydrogens summed into heavy atoms:
elementType: O O C C C C C C C C C C C C C C C C
charge: -0.105577 -0.119805 0.186973 0.191642 0.238014 0.339287 -0.082649 -0.080737 -0.340689 -0.307872 0.446725 0.447535 -0.155743 -0.194998 -0.077551 -0.127985 -0.127361 -0.129207
polarizability: 2.68925044e+02 1.14787611e+01 1.83969540e+02 -4.25078082e-01 1.31063287e+00 1.10551985e+02
1716.lowfreq: -10.4853 -5.2106 -0.0005 -0.0001 0.0006 6.8812 12.3986 33.3741 43.5174
frequency: 9.0206 33.3207 43.5067 59.4763 72.0738 106.1280 113.6757 133.6728 138.0241 170.3046 200.3185 228.3612 256.4389 275.0229 281.3587 293.8904 301.6270 333.6006 372.5317 378.7475 417.9316 439.8039 477.6406 519.1945 523.2542 543.9137 577.3709 613.5651 618.6717 645.2905 711.2807 718.8065 763.5555 779.1642 839.7294 853.4187 884.2028 893.1394 906.1791 916.5768 931.8340 938.8102 960.3116 972.3136 986.1569 988.2926 994.6281 1010.0703 1017.5354 1046.2869 1047.2116 1117.8100 1125.7546 1158.8449 1166.1233 1186.0175 1199.4378 1202.3536 1243.4707 1250.7086 1283.8058 1293.2318 1297.7425 1309.0833 1356.9724 1367.1775 1375.6423 1395.4470 1397.3435 1397.8447 1404.1431 1418.7014 1470.0143 1471.3579 1472.0308 1475.4667 1476.2916 1479.6543 1487.8127 1515.0652 1561.0072 1577.7310 1619.5697 1623.9973 2959.7499 2974.4423 2975.6572 2976.3069 3017.5805 3054.0749 3055.2692 3081.9446 3084.1076 3095.0806 3099.2673 3110.9003 3116.8194 3120.5198 3142.8207 3143.3919 3537.7540 3550.2792
redmass: 1.0167 1.2036 2.9027 3.9523 3.6824 4.3537 4.6675 5.1998 4.5624 3.7149 3.7117 3.7787 1.1746 3.1621 2.0702 2.6616 3.1001 1.6031 3.5752 3.1035 2.4910 2.8414 4.1150 5.1453 3.9372 4.0564 2.9887 4.3500 4.7905 4.3074 4.8864 4.9973 4.4934 4.4865 1.3033 1.3675 2.1643 1.6571 2.2041 2.5688 3.7383 3.2662 1.7397 1.5364 1.3489 1.3810 6.1030 1.6044 1.5882 1.5492 1.5584 1.9384 1.6658 1.1964 1.2846 1.6148 1.1251 1.4476 2.1962 1.9040 2.2306 1.6835 1.3761 1.4291 3.3486 3.3117 1.4923 1.5310 1.2516 1.2400 3.0236 2.9906 1.0501 1.1010 1.0593 1.1122 1.1405 1.1235 2.4286 3.1165 5.6243 6.7267 6.1894 6.3515 1.0576 1.0386 1.0394 1.0672 1.1053 1.0974 1.0952 1.0989 1.0997 1.0907 1.0945 1.0912 1.0886 1.0885 1.0964 1.0969 1.0662 1.0663
irintensity: 0.4884 0.7129 0.1822 1.1589 0.5164 0.9900 3.8651 2.5059 5.0191 1.6723 0.0604 1.0336 162.3664 5.6674 11.3581 1.3766 7.7938 121.3657 1.5329 12.3238 8.2266 14.1986 3.5071 1.6316 14.8777 4.1046 1.5235 6.2993 14.8403 0.1246 0.7859 1.9162 5.7846 12.8998 74.3948 20.0113 38.7475 11.3976 13.8227 19.7027 49.1676 4.0583 1.7710 0.8078 2.7399 9.8292 9.3394 5.4353 1.8836 11.5349 20.1298 7.4037 11.4374 24.2618 27.3938 10.5019 1.7409 13.8210 6.4070 6.9877 9.9786 9.8386 5.5976 0.4049 6.6825 3.7601 25.0856 7.5626 12.6743 8.0320 3.7073 2.5156 14.9584 10.2958 9.0351 5.6036 14.9064 12.8573 66.5229 0.9456 1.5252 0.9699 1.2362 11.5720 60.8942 53.4652 37.4050 69.7972 38.3608 20.5603 23.3426 14.2821 17.2841 24.2193 17.7976 21.6463 17.9969 13.6221 10.4313 8.7812 3.6524 4.5232
temp: 298.150 k
press: 1.00000 atm
elementType: 8 8 6 6 6 6 6 6 6 6 6 6 6 6 6 6 6 6 1 1 1 1 1 1 1 1 1 1 1 1 1 1 1 1 1 1
symmnumber: 1
zpe: 775245.1 jmol-1
zpe.correction: 0.295275 hartree
zpe.thermalcorrener: 0.313595 hartree
zpe.thermalcorrenthalpy: 0.314539 hartree
zpe.thermalcorrgfe: 0.246723 hartree
zpe.sumelectzpe: -769.628243 hartree
zpe.sumelectthermal: -769.609924 hartree
zpe.sumelectthermalent: -769.608980 hartree
zpe.sumelectthermalfe: -769.676796 hartree
dipole: 1.6571 1.6573 1.5833
dipole: 2.8283
quadrupole: -88.1277 -102.4762 -107.0428
quadrupole: -0.8601 -2.4064 6.4033
quadrupole: 11.0879 -3.2606 -7.8272 -0.8601 -2.4064 6.4033
hfenergy: -769.9235187 hartree
pointgroup: C01 [X(C16H18O2)]
dipole: -0.6803098 -0.6149312 0.6302851 debye
polarizability: 269.8681406|7.1014475|183.0090771|-0.6756055|-1.7381222|110.5693517 unknown
InChI: InChI=1S/C16H18O2/c1-11-3-5-15(13(7-11)9-17)16-6-4-12(2)8-14(16)10-18/h3-8,17-18H,9-10H2,1-2H3
charge 0 multiplicity 1
36 atoms
O  -0.843017 3.381576 0.060341
O  0.857746 -3.302714 0.033514
C  -0.747908 -0.015103 -0.0351
C  0.749198 0.063017 -0.033942
C  -1.582578 1.030174 0.472555
C  1.571068 -1.00892 0.440311
C  -1.383488 -1.158904 -0.597486
C  1.3963 1.213408 -0.564721
C  -2.994812 0.888239 0.412639
C  2.980491 -0.90023 0.353523
C  -3.624721 -0.241605 -0.158238
C  3.623244 0.23402 -0.19607
C  -2.785947 -1.268517 -0.662929
C  2.800616 1.297996 -0.642764
C  -1.03616 2.311113 1.077759
C  0.99779 -2.253356 1.083266
C  -5.137394 -0.358282 -0.227011
C  5.135545 0.301151 -0.315322
H  -0.753761 -1.967938 -0.9839
H  0.784112 2.052735 -0.912564
H  -3.61971 1.686425 0.838056
H  3.591199 -1.732976 0.726509
H  -3.235449 -2.162598 -1.113118
H  3.261352 2.202383 -1.058568
H  -1.720516 2.681416 1.868056
H  -0.033346 2.173558 1.50931
H  1.690921 -2.616998 1.869633
H  0.011115 -2.043677 1.541482
H  -5.63334 0.487264 0.280194
H  -5.490144 -0.374288 -1.275829
H  -5.49234 -1.292296 0.247254
H  5.494536 1.345205 -0.323757
H  5.633385 -0.225971 0.518103
H  5.480491 -0.173497 -1.254708
H  -1.690682 3.477127 -0.445423
H  0.530204 -4.134938 0.463547
