program: Gaussian 09
title: 000246700
version: EM64L-G09RevD.01
frameworkgroup: C1[X(C16H16O2)]
method: RPBEPBE
basis: SDD
operation: Freq
keyword: #pfreq=noraman
keyword: PBEPBE/SDD
title: #p freq=noraman PBEPBE/SDD
converged: YES YES NO NO
title: Mulliken charges:
elementType: O O C C C C C C C C C C C C C C C C H H H H H H H H H H H H H H H H
charge: -0.441233 -0.441233 0.036044 0.036043 -0.613244 -0.613245 0.371965 0.371966 0.154330 0.154331 -0.469319 -0.469319 -0.360639 -0.360639 -0.238061 -0.238061 -0.437348 -0.437348 0.231912 0.228023 0.231912 0.228023 0.241366 0.241366 0.273089 0.273090 0.229737 0.229737 0.224980 0.231027 0.224980 0.231028 0.337369 0.337369
chargesum: 0.00000
title: Mulliken charges with hydrogens summed into heavy atoms:
elementType: O O C C C C C C C C C C C C C C C C
charge: -0.103864 -0.103864 0.036044 0.036043 -0.153309 -0.153309 0.371965 0.371966 0.154330 0.154331 -0.227953 -0.227954 -0.087549 -0.087549 -0.008324 -0.008324 0.018660 0.018660
polarizability: 2.34186122e+02 -5.13893685e-05 1.88513770e+02 -1.74661459e+01 -2.20430639e-05 1.15286701e+02
1716.lowfreq: -6.1622 -4.3465 0.0005 0.0006 0.0007 4.5515 58.9330 61.6400 80.1202
frequency: 58.8908 61.6349 80.0738 122.6708 129.6105 151.5435 167.4661 183.9657 236.0207 242.2351 294.4168 326.0697 334.2190 354.6856 357.0798 366.1907 429.8754 440.5484 455.8516 499.3706 518.3559 533.6201 539.5218 578.1404 588.4544 618.6970 649.0015 715.0653 743.8640 765.4464 779.9481 788.6272 799.4954 838.2850 886.1850 907.8250 913.6038 939.2178 960.8923 963.0481 974.7309 979.3918 981.1743 991.0057 996.5020 1018.2672 1041.2288 1082.2662 1101.5718 1142.6103 1158.3827 1164.4358 1175.5817 1177.0381 1187.1156 1232.4082 1235.5984 1238.9188 1248.0786 1256.4580 1300.8731 1306.8622 1312.7419 1342.6480 1357.3807 1364.4937 1376.0443 1379.2462 1426.6863 1441.0569 1454.3191 1456.6568 1459.1037 1460.8660 1473.4349 1480.1780 1569.7232 1588.5095 1600.3434 1604.8409 2967.9209 2974.6292 2981.7943 2985.4237 3049.9686 3050.9701 3060.4618 3061.1743 3122.2131 3122.3873 3140.9738 3140.9797 3161.2735 3161.4664 3553.5647 3553.8655
redmass: 4.3812 5.9279 3.8864 2.9981 3.2854 4.6830 2.5659 3.5821 2.7261 3.2343 3.7393 2.1821 1.6034 2.3393 2.7468 2.0241 2.8330 4.4823 3.1642 4.0095 4.6983 5.2678 3.5236 3.5456 3.0626 4.5232 4.5318 4.9129 2.4511 5.0792 5.4168 1.2670 1.5742 2.0811 4.4228 1.3301 1.3440 4.8081 2.5143 1.6779 1.7685 1.4350 1.5836 5.7941 2.5900 3.3167 2.3644 2.0281 1.6844 1.1676 1.1274 1.1134 1.1779 1.1819 1.3803 2.3829 1.9808 2.8035 1.8103 2.3143 1.6029 1.3244 1.3951 1.9069 1.3964 1.6054 2.2248 2.7696 2.3404 2.3900 1.2728 1.7216 1.3216 2.2857 1.2075 1.1326 6.6004 7.4451 6.2275 6.4022 1.0673 1.0618 1.0617 1.0634 1.0941 1.0999 1.1015 1.0988 1.0872 1.0871 1.0910 1.0909 1.0986 1.0986 1.0660 1.0660
irintensity: 1.9476 0.0105 1.4705 0.2664 0.2631 0.0040 3.0217 3.8391 1.2007 5.9434 0.0208 32.0554 156.0182 17.8096 85.3043 2.4150 31.5008 5.6240 3.7224 2.0587 0.6603 0.2973 0.2039 0.0088 0.8415 3.7691 7.1289 6.2473 33.6228 3.2629 2.2372 9.6524 75.2479 26.3109 3.5771 0.6019 0.9358 141.0792 26.7725 18.1178 0.0055 2.5115 4.5779 6.5407 0.5865 15.5763 0.4277 1.5222 8.1472 4.4459 5.3303 41.9067 0.7003 6.4582 12.4847 8.5226 0.0776 1.7815 0.5827 2.0961 0.7078 23.3836 13.7565 3.8598 30.0570 10.1507 1.9381 4.7219 16.1359 12.0979 10.8420 10.3227 8.0480 4.0297 4.6827 0.0004 1.8632 0.0709 1.7848 2.7261 23.8177 33.1123 56.9003 4.9937 41.3668 25.7218 11.8384 18.6557 0.8035 12.7383 14.4527 12.2622 47.8771 0.0644 14.5879 3.6175
temp: 298.150 k
press: 1.00000 atm
elementType: 8 8 6 6 6 6 6 6 6 6 6 6 6 6 6 6 6 6 1 1 1 1 1 1 1 1 1 1 1 1 1 1 1 1
symmnumber: 1
zpe: 727015.8 jmol-1
zpe.correction: 0.276906 hartree
zpe.thermalcorrener: 0.292403 hartree
zpe.thermalcorrenthalpy: 0.293347 hartree
zpe.thermalcorrgfe: 0.234876 hartree
zpe.sumelectzpe: -768.452766 hartree
zpe.sumelectthermal: -768.437269 hartree
zpe.sumelectthermalent: -768.436324 hartree
zpe.sumelectthermalfe: -768.494796 hartree
dipole: 0.0000 4.2583 0.0000
dipole: 4.2583
quadrupole: -100.7021 -110.4234 -106.6561
quadrupole: 0.0000 -3.4036 0.0001
quadrupole: 5.2251 -4.4962 -0.7289 0.0000 -3.4036 0.0001
hfenergy: -768.7296718 hartree
pointgroup: C01 [X(C16H16O2)]
dipole: 0.0000111 1.6753405 -0.0000158 debye
polarizability: 235.9042333|-0.000277|188.5137698|-9.8910043|-0.0001541|113.5685897 unknown
InChI: InChI=1S/C16H16O2/c17-9-13-5-1-3-11-7-8-12-4-2-6-14(10-18)16(12)15(11)13/h1-6,17-18H,7-10H2
charge 0 multiplicity 1
34 atoms
O  2.047531 -2.587706 2.115631
O  -2.047598 -2.587706 -2.115681
C  0.74498 0.125171 -0.068011
C  -0.74502 0.125178 0.06794
C  0.492836 2.593374 -0.598017
C  -0.492852 2.593381 0.597936
C  1.360186 1.346432 -0.506559
C  -1.360214 1.346448 0.506481
C  1.590457 -0.979009 0.274084
C  -1.590508 -0.978995 -0.27415
C  2.746683 1.399805 -0.752345
C  -2.746711 1.399836 0.752265
C  2.985206 -0.898726 0.016701
C  -2.985256 -0.898696 -0.016771
C  3.559243 0.263912 -0.531047
C  -3.559282 0.26395 0.53097
C  1.10197 -2.2025 1.050899
C  -1.102031 -2.202496 -1.050957
H  1.127804 3.497449 -0.588019
H  -0.089514 2.609692 -1.542258
H  -1.127811 3.497462 0.587935
H  0.089499 2.609696 1.542177
H  3.193799 2.338149 -1.101488
H  -3.193818 2.338186 1.101404
H  3.611099 -1.756911 0.283018
H  -3.611157 -1.756876 -0.283085
H  4.634202 0.303466 -0.738498
H  -4.634241 0.303517 0.738419
H  0.09453 -2.019777 1.473815
H  1.0576 -3.108343 0.422427
H  -0.094591 -2.019782 -1.473877
H  -1.057664 -3.108333 -0.422477
H  2.216203 -1.797471 2.689978
H  -2.216258 -1.797478 -2.690043
