program: Gaussian 09
title: 000246684
version: EM64L-G09RevD.01
frameworkgroup: C1[X(C8H8BrCl)]
method: RPBEPBE
basis: SDD
operation: Freq
keyword: #p
keyword: freq=noraman
keyword: PBEPBE/SDD
title: #p freq=noraman PBEPBE/SDD
converged: NO YES NO YES
title: Mulliken charges:
elementType: Br Cl C C C C C C C C H H H H H H H H
charge: 0.037616 -0.016549 0.344644 0.360186 -0.378021 -0.400511 -0.803168 -0.803988 -0.178696 -0.071939 0.256049 0.263084 0.234925 0.230543 0.230526 0.230302 0.234626 0.230370
chargesum: 0.00000
title: Mulliken charges with hydrogens summed into heavy atoms:
elementType: Br Cl C C C C C C C C
charge: 0.037616 -0.016549 0.344644 0.360186 -0.121972 -0.137427 -0.107173 -0.108690 -0.178696 -0.071939
polarizability: 1.62257976e+02 -3.25055642e+00 1.17042981e+02 1.22174023e-02 -5.47829189e-04 5.01092766e+01
1716.lowfreq: -6.1936 -0.0012 -0.0011 -0.0009 5.7666 11.6006 79.7354 118.6275 127.7139
frequency: 79.7139 118.6142 127.7130 148.6840 174.7023 208.0868 235.1698 282.7025 303.9681 335.5878 372.9056 445.2920 485.0771 561.8901 584.7314 645.2296 699.0654 752.5761 872.9175 876.8694 878.1282 997.2210 1005.2383 1030.1219 1052.4774 1122.3272 1153.8657 1243.3088 1256.5001 1345.1851 1361.1129 1394.9204 1407.9284 1462.1776 1466.0938 1467.1166 1476.2694 1478.9034 1564.8661 1596.0891 2972.8858 2974.5534 3044.7757 3048.9317 3089.4576 3091.8972 3150.0901 3153.4600
redmass: 4.4147 1.0402 2.8273 22.4282 1.2006 6.7049 3.3839 3.1187 4.6093 4.5482 8.7523 2.8616 3.5299 4.7674 5.1813 6.9196 3.1444 4.2874 1.3775 8.0086 1.3408 1.3977 1.5770 1.4410 1.6267 1.9300 4.1517 3.0548 1.2613 5.5261 7.1600 1.2375 1.2331 1.0461 2.1462 1.3202 1.0449 1.1166 7.2311 6.4781 1.0376 1.0385 1.0970 1.0969 1.0987 1.0979 1.0918 1.0925
irintensity: 0.1048 0.0068 2.2851 0.2048 0.0552 0.3593 0.0160 1.6106 0.4561 0.6682 5.7115 13.4569 1.3234 2.0272 0.0982 19.4308 0.0570 0.8619 2.3491 56.4076 23.6520 24.0483 1.2608 17.5847 0.0127 24.0703 15.7903 4.5668 0.2985 13.1549 0.1342 7.3046 20.5794 0.0379 67.5041 51.5891 33.5604 7.0777 2.7526 1.2377 52.7994 10.0271 38.5134 0.0119 34.0756 4.0198 5.4540 1.2327
temp: 298.150 k
press: 1.00000 atm
elementType: 35 17 6 6 6 6 6 6 6 6 1 1 1 1 1 1 1 1
symmnumber: 1
zpe: 350490.3 jmol-1
zpe.correction: 0.133495 hartree
zpe.thermalcorrener: 0.144007 hartree
zpe.thermalcorrenthalpy: 0.144951 hartree
zpe.thermalcorrgfe: 0.096277 hartree
zpe.sumelectzpe: -782.442339 hartree
zpe.sumelectthermal: -782.431826 hartree
zpe.sumelectthermalent: -782.430882 hartree
zpe.sumelectthermalfe: -782.479557 hartree
dipole: 4.0189 -1.0276 0.0006
dipole: 4.1482
quadrupole: -66.8646 -71.6218 -78.2131
quadrupole: 0.8934 0.0019 0.0001
quadrupole: 5.3686 0.6113 -5.9799 0.8934 0.0019 0.0001
hfenergy: -782.5758333 hartree
pointgroup: C01 [X(C8H8Br1Cl1)]
dipole: -1.6309963 -0.058129 -0.0002514 debye
dipolederiv: -0.49096 0.260104 -0.0000336 0.3116239 -0.1842338 0.0000429 -0.0000056 -0.0000045 -0.0099003 -0.5269582 -0.3179287 -0.0000331 -0.3433481 -0.3166627 -0.0000291 -0.000058 -0.0000509 -0.0440248 0.2135461 0.2072007 0.0000286 0.1943847 0.0450228 0.0000447 -0.0000315 0.0000193 -0.0432047 0.2437878 -0.1842918 0.000097 -0.2024717 0.0516906 -0.0000483 0.0002721 -0.0001729 -0.039691 -0.311653 0.0569463 -0.0000147 0.1239524 -0.06195 0.0000078 -0.0000252 -0.0000009 -0.1102691 -0.2408002 -0.088786 -0.0000203 -0.0422937 -0.0862143 -0.0000373 0.0000182 -0.0000318 -0.1201293 -0.1310774 -0.1033955 -0.0000211 -0.0228427 0.0394966 0.0000096 -0.0000528 0.0000204 0.0633962 -0.1381264 0.098429 -0.0000462 0.0198989 0.0523149 0.0000417 -0.0002698 0.0001478 0.0609337 0.6953023 -0.6510893 0.0000412 -0.5516715 0.2092661 -0.0000586 0.0000465 -0.0000425 -0.1049567 0.5150502 0.7052131 0.0000386 0.5025627 0.3521641 0.0000658 0.0000186 0.0001288 -0.0311875 0.0805391 -0.0193726 -0.0000057 -0.0046383 -0.0614333 -0.0000118 -0.0000161 0.000003 0.15412 0.0686833 0.0295261 0.0000101 0.0135361 -0.0540482 -0.0000097 0.0000136 -0.0000239 0.1587436 0.0803316 0.0990179 0.0000135 -0.0181574 -0.1329199 -0.0000506 -0.0000194 -0.0000296 0.1124475 -0.0358973 -0.0209629 0.0894591 0.0031942 0.0719566 -0.0720051 0.1289084 -0.0231046 -0.0398331 -0.0358188 -0.0209467 -0.0894542 0.0032099 0.0719164 0.0720411 -0.1288421 0.0231291 -0.0398201 -0.0341845 0.0186972 0.0856597 -0.0089837 0.0716039 0.0773026 0.1288894 0.0285381 -0.039405 0.0822734 -0.0874544 -0.0001067 0.0306277 -0.1397719 -0.000268 0.0000473 -0.0002907 0.1126799 -0.0340381 0.0190938 -0.0856123 -0.0085834 0.0718021 -0.0770376 -0.1288937 -0.0282342 -0.0398992 unknown
polarizability: 161.5589694|-6.4562433|117.7419875|0.0120536|-0.0020676|50.1092766 unknown
InChI: InChI=1S/C8H8BrCl/c1-5-3-7(9)8(10)4-6(5)2/h3-4H,1-2H3
charge 0 multiplicity 1
18 atoms
Br 2.901101 -1.649332 0.000192
Cl 2.67964 1.74942 0.000224
C  -1.250476 -0.741548 -0.00013
C  -1.290258 0.687078 -0.000108
C  0.004633 -1.394367 -0.000042
C  -0.073911 1.407111 0.000003
C  -2.52864 -1.559097 -0.000275
C  -2.611442 1.432638 -0.000338
C  1.21364 -0.664848 0.000061
C  1.170956 0.743186 0.000076
H  0.047044 -2.487972 -0.000046
H  -0.085657 2.501772 0.000044
H  -2.313524 -2.640462 -0.000473
H  -3.151015 -1.337142 0.887752
H  -3.151012 -1.336803 -0.888219
H  -3.22162 1.175742 0.886748
H  -2.45652 2.524275 0.000941
H  -3.220141 1.17765 -0.889012
