program: Gaussian 09
title: 000020103
version: EM64L-G09RevD.01
frameworkgroup: C1[X(C20H26O4)]
method: RPBEPBE
basis: SDD
operation: Freq
keyword: #pfreq=noraman
keyword: PBEPBE/SDD
title: #p freq=noraman PBEPBE/SDD
converged: NO YES NO NO
title: Mulliken charges:
elementType: O O O O C C C C C C C C C C C C C C C C C C C C H H H H H H H H H H H H H H H H H H H H H H H H H H
charge: -0.440772 -0.307756 -0.239335 -0.211358 -0.156099 0.377198 -0.089609 -0.197489 -0.520847 -0.192046 -0.536765 -0.512311 0.171846 -0.459966 -0.490849 -0.799082 -0.621097 0.545999 -0.235052 -0.586782 -0.355629 0.180674 0.290224 -0.761226 0.214762 0.259912 0.262324 0.201602 0.201007 0.203701 0.214193 0.227169 0.240511 0.218251 0.240080 0.218571 0.232039 0.220878 0.232729 0.225946 0.221266 0.226215 0.234812 0.256873 0.332056 0.263969 0.254113 0.248030 0.245779 0.251342
chargesum: 0.00000
title: Mulliken charges with hydrogens summed into heavy atoms:
elementType: O O O O C C C C C C C C C C C C C C C C C C C C
charge: -0.108717 -0.307756 -0.239335 -0.211358 0.058663 0.377198 0.170303 0.064835 -0.118238 0.011655 -0.095404 -0.053549 0.171846 -0.001315 -0.037932 -0.119141 -0.160070 0.545999 0.021821 -0.322813 -0.101516 0.180674 0.290224 -0.016075
polarizability: 2.70260632e+02 3.12306317e+01 2.05761025e+02 8.51048476e+00 8.60607011e-01 1.92659336e+02
1716.lowfreq: -33.8389 -13.9215 -11.0329 -0.0009 -0.0004 -0.0003 2.7039 32.3777 39.5237
frequency: -33.8101 32.3402 39.4789 54.3121 60.8141 84.1067 105.5711 112.5141 137.2570 152.0983 175.1288 190.5177 192.9655 209.9658 238.3453 253.3976 260.1189 273.4121 283.8595 291.0815 300.2075 335.5578 354.0532 359.2606 377.4584 388.8877 420.6557 441.7200 460.1488 479.8278 489.6046 505.1940 535.7787 538.5179 553.1797 571.3440 592.7006 606.5065 625.5990 659.3549 680.2158 713.5995 717.8365 729.5409 806.6968 820.7623 828.3637 834.1067 850.0077 866.3527 881.4008 895.9708 905.1803 911.9588 935.5930 944.0372 958.4453 976.9042 984.1360 992.1475 999.3791 1006.2052 1015.5005 1025.7419 1028.9583 1037.2115 1045.2241 1051.4342 1069.6540 1084.2221 1087.0144 1113.0983 1125.9331 1131.9702 1148.2064 1157.2786 1171.3199 1186.7639 1194.6072 1196.6702 1208.0856 1223.6979 1227.7063 1235.6262 1244.9229 1253.8292 1265.2923 1280.0791 1285.2501 1286.7070 1296.3509 1299.2221 1314.4329 1324.6657 1329.5145 1335.9512 1341.1150 1348.3615 1349.2292 1364.5575 1375.7107 1380.1324 1382.2745 1400.2714 1452.5739 1453.5054 1459.0704 1461.3371 1463.8408 1466.5211 1475.3884 1477.9692 1490.6850 1494.5376 1556.0361 1619.5700 1656.6725 1664.6601 2901.3846 2924.6082 2946.5153 2956.6567 2968.5021 2982.6201 2992.3331 2993.8798 2994.9385 2998.7511 3006.7076 3008.1688 3021.9927 3041.9610 3052.1461 3055.4422 3059.7563 3081.6921 3084.9672 3090.8577 3094.4781 3125.4282 3135.9644 3142.9162 3158.3574 3555.6919
redmass: 1.0807 5.9016 6.3134 5.4926 4.2416 3.2968 2.9919 2.5313 3.9459 1.9581 5.6279 2.3690 3.3512 2.7023 2.4203 3.0869 3.6226 3.3887 2.0489 2.9821 1.4537 2.8899 3.9683 2.4555 3.7324 3.5370 3.6288 3.4349 3.1110 4.1274 2.9237 4.3068 2.7274 3.2601 4.7632 3.3697 3.2502 3.0569 3.3455 3.4814 4.5920 2.8957 3.7911 3.1394 2.1259 1.6656 1.9730 1.5643 2.2069 2.5321 3.6617 2.6895 1.6868 2.8552 2.3193 2.0712 2.8760 2.4181 1.9855 1.7219 1.4891 2.1656 2.3331 2.1660 2.3808 1.6632 2.3366 2.5021 2.8491 1.8227 2.2514 2.0285 1.6984 1.7874 1.6050 1.9651 1.5207 3.1491 2.2888 1.3611 1.3852 1.4321 1.5844 1.3003 1.3722 1.4693 1.5140 1.4178 2.1584 1.4029 1.3546 1.4120 1.3771 1.3361 1.4162 1.4107 1.4291 1.5036 2.1148 1.5295 2.2378 1.2339 1.3475 1.2228 1.0601 1.0486 1.0805 1.0920 1.1003 1.0744 1.0667 1.0808 1.0813 1.0628 8.8023 8.5096 9.8654 7.5031 1.0808 1.0844 1.0603 1.0813 1.0634 1.0625 1.0522 1.0626 1.0585 1.0787 1.0367 1.0876 1.0620 1.0988 1.1016 1.1018 1.0997 1.0995 1.1020 1.0990 1.0974 1.0858 1.0923 1.1009 1.0991 1.0661
irintensity: 1.1685 2.6927 0.4378 1.6771 1.7506 0.2642 1.2734 0.4644 0.5668 1.3168 13.1204 1.5422 0.5205 0.2293 5.3378 2.2924 1.7311 2.6029 20.8120 36.0747 105.5186 1.8451 6.4782 0.5152 7.7623 2.5275 2.5854 3.8098 4.0611 3.9829 6.9292 6.2532 1.5010 3.4189 2.2416 2.3231 8.5803 2.4319 0.6899 2.2743 5.6620 6.3707 5.3307 4.4338 5.6291 5.5369 9.7425 15.1305 18.6279 2.3915 22.7193 13.2469 63.2439 36.6682 57.9323 6.0610 30.1131 42.5916 37.9112 10.8061 13.3329 59.6487 10.4326 5.0080 5.8390 5.6559 16.2550 11.1254 4.4336 3.6637 6.2489 6.3889 15.0164 1.5345 8.9592 10.9654 12.9333 216.7488 67.2555 14.7870 3.5965 9.6072 17.1219 19.2716 0.7769 3.0108 3.5075 0.5468 25.4783 6.1660 5.0674 3.9797 16.2390 3.2339 0.3411 6.2902 3.1142 0.2172 1.7540 1.9381 12.5155 46.6813 2.2208 23.2517 25.0909 17.5073 4.6027 9.6669 9.5689 8.5445 8.1478 4.8181 11.3945 6.7652 209.6823 16.7067 137.2452 119.0292 6.7108 51.3498 55.2832 7.4012 25.7607 23.3657 16.9512 25.9588 5.2130 22.4203 2.9362 61.7455 35.4953 41.7150 13.3901 37.6795 31.2867 37.0847 40.9858 25.9310 6.8373 4.3748 7.1549 9.5041 10.2404 5.3563
temp: 298.150 k
press: 1.00000 atm
elementType: 8 8 8 8 6 6 6 6 6 6 6 6 6 6 6 6 6 6 6 6 6 6 6 6 1 1 1 1 1 1 1 1 1 1 1 1 1 1 1 1 1 1 1 1 1 1 1 1 1 1
symmnumber: 1
zpe: 1099216.0 jmol-1
zpe.correction: 0.418669 hartree
zpe.thermalcorrener: 0.440660 hartree
zpe.thermalcorrenthalpy: 0.441604 hartree
zpe.thermalcorrgfe: 0.368634 hartree
zpe.sumelectzpe: -1076.791192 hartree
zpe.sumelectthermal: -1076.769201 hartree
zpe.sumelectthermalent: -1076.768257 hartree
zpe.sumelectthermalfe: -1076.841227 hartree
dipole: 4.7143 2.6891 -0.1770
dipole: 5.4302
quadrupole: -192.5868 -142.9945 -129.3511
quadrupole: -18.2513 -4.3470 -2.5485
quadrupole: -37.6094 11.9830 25.6263 -18.2513 -4.3470 -2.5485
hfenergy: -1077.2098611 hartree
pointgroup: C01 [X(C20H26O4)]
dipole: 1.831825 1.0790042 0.210897 debye
polarizability: 269.0397199|29.2854476|205.6549077|16.3066259|4.4137424|193.9863657 unknown
InChI: InChI=1S/C20H26O4/c1-12(21)24-20-10-7-14(22)11-13(20)3-4-15-16-5-6-18(23)19(16,2)9-8-17(15)20/h7,10-11,15-18,23H,3-6,8-9H2,1-2H3
charge 0 multiplicity 1
50 atoms
O  5.536867 0.447793 -1.085295
O  -1.286245 1.523721 0.366176
O  -4.568903 -2.505749 -1.289558
O  -3.576133 1.667995 0.83808
C  2.3294 -0.740789 0.430381
C  3.029097 0.271628 -0.529264
C  0.882737 -0.33876 0.779865
C  0.068146 -0.261123 -0.555367
C  2.234694 0.301013 -1.855928
C  4.438369 -0.400476 -0.605072
C  3.360669 -0.953598 1.573039
C  0.739674 0.651151 -1.62001
C  -1.432238 0.144369 -0.263372
C  4.749175 -0.823433 0.857937
C  0.22787 -1.321554 1.776577
C  3.161025 1.697023 0.064037
C  -1.262776 -0.962187 2.044446
C  -2.001064 -0.863682 0.730595
C  -2.243231 0.28341 -1.529568
C  -2.991799 -1.729552 0.360807
C  -3.242055 -0.57673 -1.865825
C  -3.661894 -1.673133 -0.955246
C  -2.434746 2.170522 0.853672
C  -2.05937 3.537842 1.388195
H  2.265766 -1.705176 -0.128077
H  0.884932 0.667598 1.243498
H  0.015257 -1.291845 -0.969605
H  2.30222 -0.696729 -2.340885
H  2.665998 1.036661 -2.565803
H  4.350361 -1.299407 -1.258246
H  3.236042 -1.934441 2.064299
H  3.242633 -0.181078 2.356534
H  0.642179 1.706336 -1.305177
H  0.202656 0.551063 -2.581666
H  5.376688 -0.039375 1.317213
H  5.327805 -1.762318 0.888485
H  0.784485 -1.313694 2.732388
H  0.283923 -2.353384 1.372643
H  3.666412 1.689473 1.045207
H  3.774068 2.325702 -0.606008
H  2.179951 2.18558 0.192123
H  -1.301955 0.008211 2.57846
H  -1.735229 -1.719464 2.694369
H  -1.971191 1.118276 -2.186649
H  5.415791 0.616233 -2.054036
H  -3.343332 -2.508148 1.048324
H  -3.798631 -0.481365 -2.804879
H  -1.614786 4.151643 0.58564
H  -1.302821 3.444096 2.186613
H  -2.955991 4.03695 1.78263
