program: Gaussian 09
title: 000246687
version: EM64L-G09RevD.01
frameworkgroup: C1[X(C11H7NO3S)]
method: RPBEPBE
basis: SDD
operation: Freq
keyword: #p
keyword: freq=noraman
keyword: PBEPBE/SDD
title: #p freq=noraman PBEPBE/SDD
converged: YES YES NO NO
title: Mulliken charges:
elementType: S O O O N C C C C C C C C C C C H H H H H H H
charge: 0.340489 -0.192401 -0.200796 -0.177047 0.012251 0.252927 0.221405 0.153054 -0.222305 -0.337251 -0.360178 -0.227818 -0.205319 -0.252338 -0.128545 -0.511909 0.269477 0.286909 0.245167 0.246455 0.262991 0.252799 0.271982
chargesum: 0.00000
title: Mulliken charges with hydrogens summed into heavy atoms:
elementType: S O O O N C C C C C C C C C C C
charge: 0.340489 -0.192401 -0.200796 -0.177047 0.012251 0.252927 0.221405 0.153054 -0.222305 -0.067775 -0.073268 0.017349 0.041136 0.010654 0.124254 -0.239928
polarizability: 2.05084103e+02 -1.05401578e+01 1.40036410e+02 1.49904619e+01 1.38652597e+01 1.13393913e+02
1716.lowfreq: -6.9485 -6.0663 -0.0005 0.0012 0.0021 4.5682 20.4620 45.3190 58.2090
frequency: 20.4435 45.2922 58.2073 90.1608 116.6474 137.9888 181.0609 195.2701 245.4715 264.0341 325.4948 390.5582 410.8554 440.2535 450.6999 522.1511 550.1940 564.7516 630.5275 650.0574 655.8721 669.3849 697.3991 707.4007 724.9616 755.9619 783.7806 790.1767 814.6014 848.1461 856.8887 896.0071 924.2150 974.9582 1002.7037 1033.4041 1047.8044 1064.0147 1088.5436 1136.3662 1144.3841 1176.3152 1212.8422 1221.1963 1258.3721 1289.4793 1341.9662 1367.8130 1385.1428 1427.3911 1451.6082 1465.0543 1521.0171 1553.1564 1575.9906 1605.0401 3145.5040 3159.3175 3170.6257 3171.5404 3184.6558 3190.3838 3234.0751
redmass: 8.6723 7.1834 7.0177 7.0218 6.6858 7.6836 6.7634 7.7906 6.8034 6.5658 9.1127 9.4282 3.8164 6.5877 6.0600 5.8408 6.1255 3.1472 7.4312 7.4716 5.9948 5.3246 7.3617 5.7629 1.1860 5.5602 2.3893 2.4022 4.9090 1.3664 4.5497 1.5034 1.3846 1.3872 1.3467 2.5826 2.7391 2.1118 1.1949 2.2405 2.0879 1.0881 10.4278 1.5145 1.8103 2.7689 2.4480 11.6743 6.0829 2.4677 6.2829 2.5812 6.2484 10.0968 6.4210 6.9687 1.0868 1.0912 1.0909 1.0962 1.0986 1.0966 1.1002
irintensity: 3.1737 0.7000 1.6468 0.8887 0.0020 1.0456 5.9678 0.6817 0.8982 2.3063 8.9327 3.3136 0.6100 1.7051 2.4090 4.7485 2.7128 1.2933 16.2246 1.8879 8.6740 24.9290 9.9952 40.0167 90.2195 19.1080 41.6893 40.1699 26.4783 6.2602 13.5925 5.7604 0.0689 2.4952 1.3844 5.2870 17.4629 14.1049 2.1916 3.0190 15.8304 4.8186 185.2638 4.7827 45.3596 137.5151 11.9408 157.2544 2.8007 7.6899 100.5567 3.8271 25.9578 209.2931 8.6707 5.0559 2.0054 6.2041 4.0878 7.4512 9.1800 2.9656 0.4655
temp: 298.150 k
press: 1.00000 atm
elementType: 16 8 8 8 7 6 6 6 6 6 6 6 6 6 6 6 1 1 1 1 1 1 1
symmnumber: 1
zpe: 406823.5 jmol-1
zpe.correction: 0.154951 hartree
zpe.thermalcorrener: 0.168503 hartree
zpe.thermalcorrenthalpy: 0.169447 hartree
zpe.thermalcorrgfe: 0.112556 hartree
zpe.sumelectzpe: -1100.635036 hartree
zpe.sumelectthermal: -1100.621484 hartree
zpe.sumelectthermalent: -1100.620540 hartree
zpe.sumelectthermalfe: -1100.677430 hartree
dipole: 1.7568 -1.7285 5.2370
dipole: 5.7880
quadrupole: -74.0631 -106.0290 -102.2955
quadrupole: -8.5864 -1.4602 -1.0548
quadrupole: 20.0661 -11.8998 -8.1663 -8.5864 -1.4602 -1.0548
hfenergy: -1100.7899866 hartree
pointgroup: C01 [X(C11H7N1O3S1)]
dipole: -0.4925156 1.619876 1.522815 debye
dipolederiv: 0.0712837 0.0303593 0.0638841 0.0300881 0.154717 0.0034275 0.1105603 -0.0261359 -0.154204 -0.7549344 -0.0232313 0.0382212 -0.0217065 -0.3080643 0.0980757 -0.3424311 0.1017338 -0.9221793 -0.3890465 -0.0252639 0.1453894 -0.0967672 -0.6872773 0.2265065 0.2712672 0.2426226 -0.4580282 -0.6206935 0.0965696 0.2181586 0.0687242 -0.5337614 -0.0532777 0.2752406 0.0356268 -0.4147887 0.7536617 -0.3040491 -0.3876331 -0.2555073 1.3478683 -0.2458918 -0.5059338 -0.2896158 0.6745697 -0.1989192 0.0848071 0.0640675 -0.0784736 0.1219677 0.0117191 0.0975385 -0.1431788 -0.0668277 0.02668 0.2381947 -0.0036547 0.2153216 -0.4420979 0.0804586 -0.1508462 0.052736 0.0278162 1.7274779 -0.0217853 0.2224235 0.0202346 0.2930962 -0.156909 0.6726122 -0.0817658 1.080404 -0.4199081 -0.0041986 -0.5324268 0.0472402 -0.1429155 0.130695 -0.8020892 0.097625 -0.3038731 -0.236915 0.1371576 -0.0362779 0.1098844 -0.0257149 -0.0846974 0.0385222 -0.1452868 -0.0523648 -0.1308554 -0.1428393 0.0233809 0.0669371 0.0666829 -0.079358 -0.0461531 0.0663988 -0.0716729 0.0840665 -0.0972716 -0.0387382 -0.0411405 0.1486836 -0.0634526 -0.0846971 -0.0406222 -0.0658064 0.0969731 -0.0389401 -0.1216047 -0.1345219 -0.1945804 0.0536243 -0.0896328 0.0517404 -0.096509 0.1872784 -0.0425426 0.0605668 -0.0803878 -0.0822618 -0.0311474 0.445987 -0.0549987 -0.0156404 -0.4718591 0.0321013 0.0487968 0.0689085 -0.1494795 -0.0089185 0.1771092 -0.0182849 0.01506 -0.0711688 -0.046731 0.014697 -0.0483699 -0.2585268 0.0043828 -0.3040224 0.0438189 0.2367025 0.078712 -0.0485912 0.0616255 -0.04389 0.04226 0.0344501 0.0317381 0.0734395 0.0992084 0.1177458 -0.0172565 0.0205054 -0.0357672 0.0666495 0.0492697 0.0632463 0.0196838 0.1329188 0.0612928 0.0754811 0.0115607 0.0959365 -0.0434516 0.0302866 0.0258828 0.0291283 0.1367627 -0.0457696 0.0442441 0.0832348 0.0354408 0.0845323 0.0053019 0.0949921 -0.0013181 0.1136053 0.0220702 0.0289936 0.0708725 0.0344001 0.150847 -0.0006504 0.1227269 -0.0137962 0.0704618 0.0964349 0.012792 -0.013775 0.0186149 0.1862881 -0.000909 -0.0640145 -0.0005848 -0.0556693 0.0163926 0.0319999 -0.0132742 0.0248006 0.2045388 -0.002986 -0.0376032 0.0010342 0.0900542 unknown
polarizability: 201.1474865|-22.7336443|124.8922017|-13.775373|-16.7762496|132.4747388 unknown
InChI: InChI=1S/C11H7NO3S/c13-11(10-6-3-7-16-10)8-4-1-2-5-9(8)12(14)15/h1-7H
charge 0 multiplicity 1
23 atoms
S  3.382832 0.026117 -0.955975
O  0.727647 0.648762 -2.397696
O  -1.416984 -2.506006 1.199835
O  -0.013302 -2.068196 -0.544603
N  -0.932049 -1.723727 0.294151
C  -0.775887 0.659094 -0.512331
C  -1.48144 -0.346174 0.196683
C  0.600144 0.497138 -1.145329
C  1.74227 0.310608 -0.245304
C  -1.40501 1.92057 -0.652959
C  -2.749291 -0.115006 0.774576
C  -2.67367 2.170055 -0.085537
C  -3.344187 1.154046 0.636332
C  1.798125 0.340043 1.151652
C  3.115889 0.137899 1.679398
C  4.073094 -0.047123 0.686749
H  -0.886452 2.702729 -1.216171
H  -3.246533 -0.932148 1.304066
H  -3.138169 3.153914 -0.208127
H  -4.329202 1.344225 1.073799
H  0.918353 0.515188 1.776427
H  3.349442 0.128112 2.746217
H  5.14098 -0.226622 0.803446
