program: Gaussian 09
title: 000246709
version: EM64L-G09RevD.01
frameworkgroup: C1[X(C23H16O4)]
method: RPBEPBE
basis: SDD
operation: Freq
keyword: #pfreq=noraman
keyword: PBEPBE/SDD
title: #p freq=noraman PBEPBE/SDD
converged: YES YES NO NO
title: Mulliken charges:
elementType: O O O O C C C C C C C C C C C C C C C C C C C C C C C H H H H H H H H H H H H H H H H
charge: -0.259052 -0.235041 -0.235156 -0.169627 0.099925 0.100080 -0.216124 -0.216127 0.223187 0.223172 0.353614 0.353468 -0.411635 -0.411629 0.252517 -0.371655 -0.386738 -0.386779 -0.371602 -0.224128 -0.224138 -0.240301 -0.245798 -0.245767 -0.240359 -0.236605 -0.236600 0.286298 0.286300 0.262562 0.262584 0.252303 0.255389 0.255263 0.252271 0.233448 0.233447 0.228535 0.229698 0.229692 0.228539 0.231283 0.231287
chargesum: 0.00000
title: Mulliken charges with hydrogens summed into heavy atoms:
elementType: O O O O C C C C C C C C C C C C C C C C C C C C C C C
charge: -0.259052 -0.235041 -0.235156 -0.169627 0.099925 0.100080 0.070174 0.070173 0.223187 0.223172 0.353614 0.353468 -0.149072 -0.149045 0.252517 -0.119352 -0.131349 -0.131516 -0.119332 0.009320 0.009309 -0.011766 -0.016101 -0.016075 -0.011821 -0.005322 -0.005314
polarizability: 3.10767524e+02 1.22296037e-02 2.37196758e+02 -2.49365649e-02 5.64258749e+00 1.91724639e+02
1716.lowfreq: -8.9794 -6.1288 -5.7612 -0.0003 0.0004 0.0009 3.3550 15.1358 45.2966
frequency: -3.8306 15.0620 45.2960 59.5054 59.6880 74.0461 100.8077 110.7745 126.6765 171.3501 197.3769 231.4076 237.4741 251.4397 265.6105 325.2878 331.9360 364.5769 388.8429 397.8915 398.7874 423.4933 425.7955 493.6962 502.4942 524.0487 533.1178 570.9524 614.7907 615.2940 640.8910 647.3867 656.2580 657.7386 661.0369 689.0173 698.8091 700.0173 713.5102 751.4456 755.2509 765.8139 765.8963 771.9482 793.1086 807.4246 849.2944 850.5650 883.7761 887.0768 888.2560 899.9294 925.3767 929.0369 941.2921 942.3456 958.0845 973.5523 974.9521 976.2752 980.8082 990.7591 991.0798 993.2266 998.0560 998.4046 1007.5877 1012.5420 1019.1721 1028.0263 1036.2222 1040.2281 1084.0615 1092.4864 1096.6423 1155.4096 1163.3218 1174.7256 1174.8175 1182.6978 1188.1098 1195.2171 1196.9855 1232.4244 1273.5659 1296.4286 1298.6934 1300.7786 1324.7214 1327.5503 1339.4932 1380.5778 1381.0438 1398.5364 1437.0141 1437.7621 1443.7991 1452.6865 1489.8672 1493.6222 1591.6433 1592.1238 1603.8447 1613.3375 1619.2788 1619.5159 1757.4731 3080.5957 3095.3083 3127.9602 3128.0202 3131.8768 3138.3517 3138.4741 3141.6911 3150.8601 3151.0980 3152.2441 3160.6685 3160.8806 3167.0838 3171.1942 3171.3301
redmass: 3.6867 3.9607 5.4643 7.1498 6.5731 5.5368 6.4406 4.4934 8.5099 5.2324 5.0526 5.1371 5.8064 5.9212 6.1451 7.9480 5.5481 7.6510 6.3945 2.7907 2.7937 3.9546 4.2298 3.7580 6.1338 4.6379 5.7761 4.4206 6.3756 6.4401 6.3581 5.2985 10.1189 6.6570 7.7112 8.1476 1.6606 1.8458 5.9646 2.1490 5.0652 1.4680 2.2444 3.8092 6.8363 7.2172 1.2560 1.2609 1.6350 2.3666 2.5088 2.6862 4.6521 1.9782 2.2231 4.7825 1.6161 6.8877 1.5246 1.4128 4.0982 4.8846 4.4247 1.3218 1.4092 1.4295 4.5905 3.7092 3.0638 3.1636 2.6971 2.0473 2.2202 1.6585 1.7714 2.1270 1.4851 1.0669 1.0534 1.5585 1.9157 1.1191 1.1292 1.5036 1.5922 1.8369 1.1785 1.7493 1.4541 1.3659 2.9690 8.1455 8.0857 6.6025 2.2332 2.2408 2.3385 2.7302 2.3908 2.5632 6.0886 6.0875 7.2637 7.1174 6.0138 6.2036 13.0011 1.0873 1.0897 1.0850 1.0850 1.0857 1.0885 1.0885 1.0901 1.0933 1.0933 1.0952 1.0965 1.0965 1.1003 1.1003 1.1003
irintensity: 0.1394 0.1406 0.2593 1.5978 1.9414 0.0352 0.5101 0.7697 0.7623 0.1838 0.0326 1.0596 0.6680 0.5727 1.3858 0.0271 0.7094 1.4048 4.8041 0.2433 0.0168 4.3248 2.0803 8.4097 0.1975 0.3163 15.4865 0.0174 0.0099 0.1710 5.6345 2.2389 26.8909 19.5455 4.1730 4.5906 13.3980 81.6195 14.1786 81.3531 0.0578 36.6590 20.2488 67.9441 5.9246 14.2149 2.3893 1.4436 0.2778 35.8439 14.0116 64.2917 3.2937 7.9662 16.7514 79.4423 8.9137 87.5010 7.4714 0.1972 142.2216 2.4309 1.5754 0.0288 0.5706 0.0306 20.3486 51.8606 87.5103 2.5941 3.8919 2.3904 0.1080 12.3214 0.2679 0.1598 7.4862 0.0574 0.2121 3.2641 4.1425 5.2275 0.3072 5.4919 5.9751 48.6757 3.7381 6.2616 9.0221 2.9532 22.9264 0.4464 0.8336 3.0048 4.2476 19.2983 14.0942 6.1386 14.1678 2.3332 0.6546 0.8622 0.5963 4.7231 0.1287 0.1101 640.2449 4.3510 16.5678 0.1748 0.2175 0.0027 0.1225 12.6853 4.9797 56.2058 5.8719 9.5984 1.5739 43.3198 26.5685 21.7670 1.1629
temp: 298.150 k
press: 1.00000 atm
elementType: 8 8 8 8 6 6 6 6 6 6 6 6 6 6 6 6 6 6 6 6 6 6 6 6 6 6 6 1 1 1 1 1 1 1 1 1 1 1 1 1 1 1 1
symmnumber: 1
zpe: 855251.5 jmol-1
zpe.correction: 0.325748 hartree
zpe.thermalcorrener: 0.345249 hartree
zpe.thermalcorrenthalpy: 0.346193 hartree
zpe.thermalcorrgfe: 0.276831 hartree
zpe.sumelectzpe: -1185.080973 hartree
zpe.sumelectthermal: -1185.061473 hartree
zpe.sumelectthermalent: -1185.060528 hartree
zpe.sumelectthermalfe: -1185.129890 hartree
dipole: -0.0012 6.8617 -1.7719
dipole: 7.0868
quadrupole: -131.5683 -171.3627 -143.6143
quadrupole: 0.0072 -0.0062 0.2791
quadrupole: 17.2801 -22.5142 5.2341 0.0072 -0.0062 0.2791
hfenergy: -1185.4067212 hartree
pointgroup: C01 [X(C23H16O4)]
dipole: 0.000316 2.7881742 -0.0041032 debye
polarizability: 310.767525|-0.013964|231.5749348|-0.0223014|-15.9959396|197.3464618 unknown
InChI: InChI=1S/C23H16O4/c24-21-25-19-20(26-21)23(16-11-5-2-6-12-16)18-14-8-7-13-17(18)22(19,27-23)15-9-3-1-4-10-15/h1-14,19-20H
charge 0 multiplicity 1
43 atoms
O  0.000139 -0.472383 -0.575779
O  -1.154175 -1.915916 1.783738
O  1.153905 -1.916027 1.783844
O  -0.000229 -3.956145 1.81954
C  -1.138758 0.101287 0.246808
C  1.138925 0.101326 0.247014
C  -0.789012 -0.492658 1.656999
C  0.788934 -0.492707 1.657108
C  -0.707676 1.575281 0.342455
C  0.707733 1.575301 0.342614
C  -2.478153 -0.19354 -0.377955
C  2.478418 -0.193305 -0.377656
C  -1.437748 2.76663 0.447176
C  1.437722 2.76669 0.447502
C  -0.000183 -2.730494 1.780659
C  -2.660463 0.12068 -1.749745
C  3.559816 -0.733645 0.359035
C  -3.56027 -0.731458 0.359451
C  2.661501 0.123494 -1.748762
C  -0.708128 3.98266 0.534057
C  0.708029 3.982687 0.534221
C  -3.904717 -0.102531 -2.374277
C  4.809644 -0.946057 -0.265413
C  -4.810081 -0.944001 -0.264976
C  3.905749 -0.09959 -2.373338
C  -4.986611 -0.632153 -1.631497
C  4.986915 -0.631671 -1.631252
H  -1.255297 0.048434 2.493327
H  1.255152 0.048288 2.493538
H  -2.532784 2.764601 0.440951
H  2.532758 2.764718 0.44152
H  -1.81759 0.523146 -2.321449
H  3.428223 -1.015404 1.407823
H  -3.429274 -1.011254 1.408851
H  1.819224 0.527955 -2.319944
H  -1.247006 4.934552 0.595521
H  1.246855 4.9346 0.595818
H  -4.031624 0.132873 -3.436693
H  5.638597 -1.36951 0.31209
H  -5.6396 -1.365589 0.313079
H  4.033227 0.137841 -3.435235
H  -5.954154 -0.806342 -2.115345
H  5.954466 -0.805766 -2.11512
