program: Gaussian 09
title: 000246676
version: EM64L-G09RevD.01
frameworkgroup: C1[X(C19H15N3O2)]
method: RPBEPBE
basis: SDD
operation: Freq
keyword: #p
keyword: freq=noraman
keyword: PBEPBE/SDD
title: #p freq=noraman PBEPBE/SDD
converged: YES YES NO NO
title: Mulliken charges:
elementType: O O N N N C C C C C C C C C C C C C C C C C C C H H H H H H H H H H H H H H H
charge: -0.449994 -0.262773 -0.462682 -0.054408 -0.389019 0.321995 -0.035966 0.180948 0.435653 0.401400 -0.588070 -0.546243 -0.564081 -0.425182 -0.419763 0.471134 -0.246375 -0.250240 -0.422521 -0.373932 0.253783 -0.334543 -0.350987 0.100768 0.343039 0.244618 0.278069 0.243201 0.257624 0.304441 0.237292 0.241299 0.226913 0.227659 0.226354 0.252957 0.271309 0.274328 0.381995
chargesum: 0.00000
title: Mulliken charges with hydrogens summed into heavy atoms:
elementType: O O N N N C C C C C C C C C C C C C C C C C C C
charge: -0.067999 -0.262773 -0.119642 -0.054408 -0.084579 0.321995 -0.035966 0.180948 0.435653 0.401400 -0.343452 -0.024974 -0.306458 -0.187890 -0.178464 0.471134 -0.019462 -0.022581 -0.196167 -0.120975 0.253783 -0.063233 -0.076659 0.100768
polarizability: 3.90887115e+02 1.14848963e+01 2.53643784e+02 -3.43507977e+00 2.43129183e+00 1.37237120e+02
1716.lowfreq: -0.0010 -0.0008 -0.0007 0.6126 6.1821 8.9174 15.5454 20.9751 36.9606
frequency: 15.4124 20.7609 36.9548 65.7730 86.8044 92.8238 117.0222 152.3206 153.6253 175.6787 232.9683 267.8315 290.8378 308.6996 320.0094 341.7330 354.4044 401.1536 417.8310 427.8955 438.0534 476.2966 479.6617 484.1393 503.4940 540.2399 561.0857 571.6725 580.0932 581.8612 607.4427 629.4356 632.5686 653.6615 686.5606 698.1985 728.8910 748.5850 749.3044 756.0047 757.2561 760.1872 785.8935 800.6954 830.4631 844.2585 848.2007 857.7528 882.8474 901.1911 914.1843 956.4997 964.4052 978.2865 984.2503 987.4138 987.9388 989.7647 1013.2636 1021.1445 1075.0450 1105.8626 1128.8969 1152.7145 1154.6395 1170.2984 1174.6147 1201.5181 1226.4374 1228.8899 1252.2829 1267.5125 1273.3445 1293.2504 1319.2151 1323.2256 1332.0276 1347.0691 1374.1800 1390.6787 1411.3379 1435.8684 1440.4013 1441.8460 1464.1761 1468.5859 1480.9827 1509.3797 1520.1950 1528.3816 1574.1790 1602.0069 1624.1232 1629.3613 1641.2221 1656.9449 2999.9480 3084.9104 3118.0078 3123.5964 3124.0311 3138.7132 3140.3945 3142.1560 3155.0916 3161.3126 3161.8027 3174.1588 3534.4494 3559.8784 3561.0012
redmass: 5.3493 6.3411 5.3956 7.7164 6.6229 4.9952 6.6070 4.6237 6.3769 5.8485 5.3847 4.0565 4.7492 5.2562 4.4818 3.8364 5.4471 3.6981 2.9775 3.6515 4.9094 2.6480 2.2753 2.0694 2.4426 4.0066 3.5134 3.8702 1.2596 4.7830 6.2981 3.7034 1.6242 3.4123 3.6477 4.4354 5.8045 4.7102 5.1122 4.5647 1.3721 5.6631 2.3066 5.1338 1.2690 1.8062 1.3804 3.1637 1.5407 5.3568 1.8943 3.7717 1.4015 1.3616 3.0480 1.3496 1.3373 3.6716 2.9872 2.3114 3.6782 2.5895 1.3346 1.5539 1.7916 1.2963 1.2474 1.2083 1.4200 1.6223 1.4963 2.0884 5.0581 1.6113 1.5885 2.9206 2.1049 1.5187 3.2920 2.4395 3.7381 3.3858 3.9528 4.0056 3.4794 1.1429 1.7987 3.8946 4.6278 3.7382 4.5968 8.6059 6.1705 6.5091 8.1668 7.8396 1.0665 1.0957 1.0860 1.0893 1.0885 1.0927 1.0883 1.0947 1.0927 1.0953 1.1002 1.0954 1.0641 1.0785 1.0808
irintensity: 1.1925 1.1759 0.2863 1.6983 1.1227 2.7424 0.8818 2.7706 0.0602 1.6203 0.3598 3.4815 0.7659 1.5626 1.2290 3.2410 3.9556 1.4112 7.6187 2.1984 11.0253 22.3935 97.3768 80.9237 14.2591 4.7553 0.8493 45.1562 70.2432 2.9575 2.4424 29.7349 60.7893 9.8138 62.5908 1.0039 9.1521 2.0597 1.5732 21.7958 46.4743 4.8948 0.5787 0.3098 1.6196 68.5843 8.9115 22.5044 70.6981 0.7260 5.3879 5.4619 9.9654 2.5935 44.8185 1.3041 0.0467 90.3007 217.2896 6.2783 23.4465 8.7347 10.2091 216.5847 4.3140 0.0100 3.1204 3.5540 52.2819 0.6067 49.4029 7.3802 59.8650 44.3772 73.7303 214.0049 7.9997 15.4632 41.0993 24.0192 2.4875 26.8991 25.6712 10.9939 15.8600 21.0368 60.0634 0.0182 21.1808 283.2656 2.6436 4.8432 7.9577 661.3182 208.7153 19.5513 23.2258 4.7550 4.0602 11.0189 0.2804 2.9641 20.8096 35.6725 4.8628 5.2544 42.3244 3.2229 54.5776 32.5085 169.8650
temp: 298.150 k
press: 1.00000 atm
elementType: 8 8 7 7 7 6 6 6 6 6 6 6 6 6 6 6 6 6 6 6 6 6 6 6 1 1 1 1 1 1 1 1 1 1 1 1 1 1 1
symmnumber: 1
zpe: 788661.1 jmol-1
zpe.correction: 0.300385 hartree
zpe.thermalcorrener: 0.319397 hartree
zpe.thermalcorrenthalpy: 0.320341 hartree
zpe.thermalcorrgfe: 0.250778 hartree
zpe.sumelectzpe: -1046.118215 hartree
zpe.sumelectthermal: -1046.099203 hartree
zpe.sumelectthermalent: -1046.098259 hartree
zpe.sumelectthermalfe: -1046.167822 hartree
dipole: 0.6810 0.5875 -0.3416
dipole: 0.9621
quadrupole: -156.0420 -128.5425 -139.0885
quadrupole: -10.6531 7.8872 7.7281
quadrupole: -14.8177 12.6818 2.1359 -10.6531 7.8872 7.7281
hfenergy: -1046.4186002 hartree
pointgroup: C01 [X(C19H15N3O2)]
dipole: -0.2495831 0.2519479 0.1323226 debye
polarizability: 388.551854|-20.7582476|255.6216518|-7.2702729|-4.8173955|137.5945119 unknown
InChI: InChI=1S/C19H15N3O2/c23-19(24)12-5-7-15(8-6-12)20-11-18-21-16-9-13-3-1-2-4-14(13)10-17(16)22-18/h1-10,20-21,23H,11H2
charge 0 multiplicity 1
39 atoms
O  5.575173 -2.840483 1.256922
O  6.46056 -2.52674 -0.86942
N  -0.416604 0.502984 0.236993
N  -1.536601 2.495773 0.341437
N  1.992079 2.206801 -0.525778
C  -1.778445 0.161721 0.167902
C  -2.474824 1.433529 0.243207
C  -0.335367 1.901489 0.338043
C  -3.877851 -1.02704 0.015239
C  -4.593181 0.245668 0.091557
C  -2.447158 -1.055768 0.054214
C  0.97947 2.640873 0.443861
C  -3.870261 1.47395 0.205418
C  -4.642808 -2.239433 -0.099173
C  -6.031329 0.230824 0.049315
C  2.860929 1.133105 -0.355004
C  -6.036044 -2.213032 -0.137269
C  -6.738737 -0.964592 -0.062178
C  3.75568 0.783443 -1.41728
C  2.898802 0.359225 0.849051
C  4.686565 -1.049885 -0.077855
C  4.647068 -0.28514 -1.278296
C  3.804435 -0.707667 0.979173
C  5.64572 -2.166477 0.018878
H  0.379634 -0.133533 0.18999
H  -1.91936 -2.013851 -0.00444
H  0.752905 3.708302 0.288097
H  1.393577 2.554308 1.466389
H  -4.401178 2.429535 0.262492
H  1.972898 2.653476 -1.442935
H  -4.107533 -3.195162 -0.156916
H  -6.56601 1.186529 0.107197
H  -6.602105 -3.146973 -0.224954
H  -7.833721 -0.957445 -0.092993
H  3.74044 1.366895 -2.346119
H  2.245467 0.605293 1.692694
H  5.331635 -0.552103 -2.090211
H  3.836088 -1.290198 1.904478
H  6.248392 -3.572102 1.249872
