program: Gaussian 09
title: 000246651
version: EM64L-G09RevD.01
frameworkgroup: C1[X(C12H15N3O4)]
method: RPBEPBE
basis: SDD
operation: Freq
keyword: #p
keyword: freq=noraman
keyword: PBEPBE/SDD
title: #p freq=noraman PBEPBE/SDD
converged: YES YES NO NO
title: Mulliken charges:
elementType: O O O O N N N C C C C C C C C C C C C H H H H H H H H H H H H H H H
charge: -0.305560 -0.228917 -0.214880 -0.201291 -0.063408 -0.150134 0.049475 -0.356867 -0.370467 -0.370301 -0.382451 -0.613010 0.240827 -0.280571 -0.284186 0.396089 -0.349320 0.271679 -0.305101 0.191507 0.222048 0.220181 0.200587 0.231581 0.206192 0.265214 0.227680 0.193020 0.227031 0.225974 0.244787 0.291976 0.275641 0.294976
chargesum: 0.00000
title: Mulliken charges with hydrogens summed into heavy atoms:
elementType: O O O O N N N C C C C C C C C C C C C
charge: -0.305560 -0.228917 -0.214880 -0.201291 -0.063408 -0.150134 0.049475 0.056687 0.050301 0.067472 0.110443 0.033015 0.240827 -0.035784 0.007791 0.396089 -0.073679 0.271679 -0.010124
polarizability: 3.63379687e+02 6.63316152e+00 1.88066963e+02 -1.23022729e+01 1.23167043e+01 9.53137788e+01
1716.lowfreq: -13.5759 -1.6529 0.0004 0.0005 0.0006 5.3908 15.2574 24.6552 39.0318
frequency: 12.0799 24.4682 38.9296 52.2964 73.1047 108.0190 123.5170 149.3354 171.8062 181.3063 190.0738 217.5288 225.4191 268.5080 312.3548 324.7159 343.0021 347.4418 399.4650 415.3801 420.0942 471.3473 490.2246 541.1568 563.0234 565.2514 612.9209 633.2320 678.4952 695.7560 707.6841 739.3868 745.2988 813.9007 831.1773 836.3230 882.7193 904.9668 907.8832 920.8352 923.7233 963.0737 988.0481 998.8007 1026.2727 1040.5600 1048.3269 1066.2449 1078.4474 1124.2895 1130.9152 1146.4196 1159.5080 1174.5859 1194.1821 1203.2012 1221.2996 1234.8067 1256.5331 1280.3184 1288.1786 1289.8832 1307.6286 1336.3966 1343.5645 1346.9683 1353.5121 1365.3148 1368.1045 1415.3459 1432.6711 1452.8100 1455.4363 1459.8536 1462.0935 1473.7725 1481.6697 1485.6518 1533.3403 1543.6525 1643.4709 2846.0585 2858.9968 2873.8502 2989.4426 2992.4482 3023.8836 3033.7825 3039.0715 3081.4146 3100.5499 3114.5312 3134.8511 3169.6218 3231.4335 3259.6618
redmass: 3.9334 4.4358 6.1042 7.6970 8.0507 6.3449 4.8117 2.9954 3.3896 4.6736 2.5893 2.4307 1.9358 3.4679 2.3105 2.4302 3.9838 3.5287 2.7099 4.8157 4.1833 2.6934 7.0889 4.3316 5.1763 4.0164 3.1120 3.2839 8.8994 5.8057 6.0310 8.8240 3.5574 1.3322 4.0764 1.6006 1.9994 1.3974 7.2587 2.4322 5.6909 2.9209 1.1353 2.4989 1.2497 1.9659 1.9457 1.7266 1.7632 1.6025 3.9926 2.6141 2.8715 1.9613 1.0906 2.0247 2.3152 2.9024 1.7745 1.8155 4.7135 1.5910 1.3839 1.3567 6.1645 1.3381 1.3614 2.1679 2.1502 2.5408 1.1702 1.0877 1.0801 1.1103 1.0720 1.0998 1.0530 8.5888 7.7036 6.0534 6.5750 1.0703 1.0666 1.0594 1.0679 1.0668 1.0740 1.0884 1.0904 1.1010 1.0966 1.0936 1.0910 1.0899 1.0962 1.1031
irintensity: 3.2541 1.1590 2.3149 0.8305 5.8625 0.0804 1.6122 4.2691 2.5308 2.1955 2.0097 0.0924 2.0580 0.3435 17.6488 3.3741 3.6896 6.8210 2.9010 1.3038 2.8605 0.0076 3.0458 3.1795 3.8480 14.1958 8.3408 3.7828 10.6343 0.1966 7.3565 12.3221 8.0423 68.3515 2.2427 0.1731 1.9502 5.4505 11.0918 0.9342 1.7359 5.3796 51.9263 50.7809 30.6176 20.6215 11.3160 11.3900 3.4048 35.3896 72.5712 44.6269 18.2430 4.1575 4.9377 325.6389 160.9568 37.2438 56.7595 52.5378 57.8938 42.9974 19.6402 7.1243 103.3294 6.2701 5.6509 5.8078 21.9183 56.5792 4.1225 17.9414 4.0363 35.9895 16.3433 14.5820 8.8895 286.9629 80.9548 119.0393 12.6504 50.1315 36.4792 218.1599 10.4191 72.1517 50.5293 43.0238 60.5478 29.5095 7.1952 17.5712 1.0342 7.6360 0.4660 5.2863
temp: 298.150 k
press: 1.00000 atm
elementType: 8 8 8 8 7 7 7 6 6 6 6 6 6 6 6 6 6 6 6 1 1 1 1 1 1 1 1 1 1 1 1 1 1 1
symmnumber: 1
zpe: 692571.4 jmol-1
zpe.correction: 0.263787 hartree
zpe.thermalcorrener: 0.281628 hartree
zpe.thermalcorrenthalpy: 0.282572 hartree
zpe.thermalcorrgfe: 0.214885 hartree
zpe.sumelectzpe: -929.872705 hartree
zpe.sumelectthermal: -929.854863 hartree
zpe.sumelectthermalent: -929.853919 hartree
zpe.sumelectthermalfe: -929.921606 hartree
dipole: 3.7372 1.4963 1.1729
dipole: 4.1930
quadrupole: -112.4813 -120.9648 -111.2141
quadrupole: -30.4782 -1.4985 -0.5511
quadrupole: 2.4054 -6.0780 3.6727 -30.4782 -1.4985 -0.5511
hfenergy: -930.1364912 hartree
pointgroup: C01 [X(C12H15N3O4)]
dipole: -1.4787691 -0.5966135 0.4226606 debye
polarizability: 362.890333|6.2583815|188.5537226|17.0571392|-10.1353432|95.3163738 unknown
InChI: InChI=1S/C12H15N3O4/c1-13-6-8-14(9-7-13)11(16)4-2-10-3-5-12(19-10)15(17)18/h2-5H,6-9H2,1H3
charge 0 multiplicity 1
34 atoms
O  -1.760905 -2.5550 -0.021372
O  2.565931 0.185376 0.105341
O  5.852235 1.60248 0.290039
O  3.819916 2.574412 -0.187971
N  -4.903639 1.179992 0.107226
N  -2.604621 -0.438409 -0.517086
N  4.564254 1.561218 0.116325
C  -3.535972 1.710159 0.301162
C  -4.937564 -0.287431 0.316316
C  -2.553989 1.030098 -0.679289
C  -3.972121 -0.989584 -0.658141
C  -5.911835 1.895957 0.912707
C  -1.557044 -1.304847 -0.204905
C  -0.178141 -0.740424 -0.107835
C  0.858582 -1.575836 0.214059
C  2.235343 -1.174987 0.328754
C  3.409044 -1.884301 0.63516
C  3.948662 0.277065 0.28237
C  4.50035 -0.960304 0.605644
H  -3.169934 1.552945 1.349125
H  -3.543738 2.798297 0.103958
H  -5.965556 -0.648441 0.12859
H  -4.662461 -0.564805 1.36584
H  -2.85485 1.286136 -1.714426
H  -1.539304 1.415687 -0.506698
H  -3.920146 -2.071552 -0.459966
H  -4.318427 -0.820288 -1.696518
H  -5.753745 1.792775 2.015499
H  -6.918364 1.508734 0.674182
H  -5.892301 2.971838 0.662995
H  0.025245 0.31565 -0.305398
H  0.627353 -2.632765 0.396316
H  3.460472 -2.949025 0.853315
H  5.553175 -1.153724 0.792383
