program: Gaussian 09
title: 000246650
version: EM64L-G09RevD.01
frameworkgroup: C1[X(C13H16BrNO4)]
method: RPBEPBE
basis: SDD
operation: Freq
keyword: #p
keyword: freq=noraman
keyword: PBEPBE/SDD
title: #p freq=noraman PBEPBE/SDD
converged: YES YES NO NO
title: Mulliken charges:
elementType: Br O O O O N C C C C C C C C C C C C C H H H H H H H H H H H H H H H H
charge: -0.016396 -0.268172 -0.248414 -0.213850 -0.230848 -0.454621 -0.287833 0.478218 0.292218 0.196675 -0.353341 -0.426581 -0.264514 -0.256165 -0.181165 -0.151182 -0.244955 -0.658312 -0.660257 0.283905 0.337130 0.263667 0.230072 0.227524 0.236621 0.240609 0.231062 0.242716 0.245028 0.255960 0.228372 0.220218 0.231675 0.250725 0.224211
chargesum: 0.00000
title: Mulliken charges with hydrogens summed into heavy atoms:
elementType: Br O O O O N C C C C C C C C C C C C C
charge: -0.016396 -0.268172 -0.248414 -0.213850 -0.230848 -0.117491 -0.003928 0.478218 0.292218 0.196675 -0.089674 -0.196509 0.199631 0.215506 0.061550 0.093846 -0.244955 0.046239 0.046354
polarizability: 2.62958928e+02 -3.63835847e+00 1.55528929e+02 3.88976358e+00 -2.46106338e+01 1.26085758e+02
1716.lowfreq: -9.6030 -2.6272 -0.0002 0.0004 0.0008 1.8485 15.2841 25.2599 37.1143
frequency: 14.7113 25.1441 37.1108 41.2806 52.2926 64.3380 73.5178 82.8634 88.3646 120.9062 133.2165 161.1401 186.6048 200.5466 215.0196 244.3852 275.3465 278.3138 312.6788 317.0333 335.3374 337.2477 411.5643 422.5774 439.0313 493.0952 504.9863 527.4030 573.8044 603.5984 628.1251 666.4885 698.1412 707.5319 745.3181 782.9358 805.1416 807.3714 811.4004 817.6943 819.1963 854.0673 886.6206 933.8009 942.7421 949.6584 982.3284 1006.6164 1012.6228 1062.8260 1090.4638 1096.8273 1102.4412 1115.6548 1151.0333 1157.6248 1158.3441 1180.3780 1194.6309 1251.4660 1276.4699 1277.0935 1293.0042 1306.9118 1324.5453 1353.4169 1357.0541 1370.4868 1394.2454 1395.5357 1411.2998 1458.5865 1459.0059 1464.1575 1464.6699 1469.8357 1483.5676 1484.2549 1503.8124 1578.6921 1616.5227 1637.9839 1652.6475 2995.6343 2995.8040 2998.3009 3032.0322 3036.5452 3089.7653 3091.2471 3098.1322 3098.5894 3123.5492 3125.8744 3129.4064 3148.3863 3166.3758 3170.0907 3523.5766
redmass: 5.7876 4.4139 3.5340 4.3349 3.8715 4.0464 4.5604 4.4330 5.0845 4.6812 5.8002 3.1793 6.2508 1.6600 1.5519 2.7666 3.4000 2.7946 3.5155 4.7127 5.2304 7.5085 3.0020 3.7276 3.5095 1.2488 2.6301 4.5193 6.0403 6.8414 7.0402 5.3254 3.1832 4.0497 4.3083 3.6068 1.4038 1.5129 1.5146 1.8121 1.9063 4.0915 5.2164 1.3858 2.7889 1.4097 4.7684 2.6252 2.8994 2.5877 2.8547 2.1642 2.8080 1.5620 3.4799 1.6825 1.7320 2.4566 1.2284 1.4690 1.1180 1.1231 1.4523 1.5148 1.8022 1.2766 1.3371 3.9344 1.2314 1.2268 3.6753 1.0928 1.0956 1.0440 1.0460 1.7672 1.0536 1.0525 2.5925 5.7575 6.2537 8.2430 8.8245 1.0365 1.0362 1.0833 1.0601 1.0600 1.0975 1.0973 1.1030 1.1028 1.1059 1.1071 1.0893 1.0881 1.0955 1.0967 1.0767
irintensity: 0.7846 1.1604 0.1620 0.6563 0.5782 0.2187 0.9977 0.6346 0.7410 2.4372 0.9864 1.1216 0.2848 2.7154 3.1263 0.1665 1.8517 3.0525 10.1801 5.4976 18.8316 34.3326 0.0554 0.4246 4.9736 90.0627 9.2797 15.2145 31.7697 6.7504 5.0624 17.7257 3.6902 7.6830 7.9194 4.7939 1.3057 0.4060 4.1126 89.5196 13.8050 18.0465 8.3459 0.7840 0.8718 0.1766 23.2587 30.3165 94.2596 35.4405 188.7512 34.8321 105.9796 34.9886 174.5855 14.1815 26.3344 207.8009 9.3682 114.7334 3.7716 8.1724 23.6823 23.2240 113.2782 1.4639 11.9241 31.7263 23.7111 19.2963 7.3773 4.5383 23.7078 14.8640 16.2933 17.7197 14.5837 11.9720 388.7216 18.9183 164.7757 84.0333 221.7457 17.6432 12.5748 28.9471 29.3455 24.3950 37.5246 32.6450 0.9196 2.2187 25.6619 25.5278 11.5659 5.1981 10.8082 0.0386 122.2914
temp: 298.150 k
press: 1.00000 atm
elementType: 35 8 8 8 8 7 6 6 6 6 6 6 6 6 6 6 6 6 6 1 1 1 1 1 1 1 1 1 1 1 1 1 1 1 1
symmnumber: 1
zpe: 710881.2 jmol-1
zpe.correction: 0.270760 hartree
zpe.thermalcorrener: 0.291342 hartree
zpe.thermalcorrenthalpy: 0.292286 hartree
zpe.thermalcorrgfe: 0.217004 hartree
zpe.sumelectzpe: -872.664718 hartree
zpe.sumelectthermal: -872.644136 hartree
zpe.sumelectthermalent: -872.643192 hartree
zpe.sumelectthermalfe: -872.718474 hartree
dipole: 5.1558 1.2607 -1.9980
dipole: 5.6713
quadrupole: -113.7871 -109.1959 -124.7595
quadrupole: -1.8546 -10.8108 -4.9802
quadrupole: 2.1271 6.7182 -8.8453 -1.8546 -10.8108 -4.9802
hfenergy: -872.9354782 hartree
pointgroup: C01 [X(C13H16Br1N1O4)]
dipole: -2.0540706 -0.6964395 0.5237385 debye
polarizability: 236.4993859|44.7935892|164.115905|9.5714321|36.8525539|143.9583243 unknown
InChI: InChI=1S/C13H16BrNO4/c1-3-18-12(16)11(13(17)19-4-2)15-10-7-5-9(14)6-8-10/h5-8,11,15H,3-4H2,1-2H3
charge 0 multiplicity 1
35 atoms
Br 5.50348 2.473522 1.436932
O  -1.88749 1.313351 1.029491
O  -2.774615 -1.906086 -0.039559
O  -2.081111 1.197411 -1.298452
O  -1.157476 -2.407053 -1.648891
N  0.482546 -0.451393 -0.726949
C  -0.799161 -0.547431 -0.060435
C  1.592318 0.232758 -0.223798
C  -1.662786 0.738869 -0.215782
C  -1.570416 -1.726221 -0.684234
C  1.538508 0.98802 0.984224
C  2.827901 0.169708 -0.933646
C  -2.693631 2.580725 1.04818
C  -3.662225 -3.005484 -0.552807
C  2.69151 1.640383 1.472341
C  3.974909 0.827015 -0.450639
C  3.900027 1.556732 0.755223
C  -1.805255 3.794805 0.768132
C  -3.294612 -4.340848 0.09617
H  -0.689818 -0.738694 1.025152
H  0.561623 -0.98036 -1.599044
H  0.60234 1.084346 1.542325
H  2.88974 -0.40181 -1.867327
H  -3.117095 2.595314 2.064673
H  -3.498531 2.485713 0.29836
H  -3.563551 -3.042999 -1.651476
H  -4.67045 -2.66519 -0.270311
H  2.637987 2.213336 2.402919
H  4.914683 0.766755 -1.007286
H  -1.401537 3.759968 -0.257101
H  -0.964716 3.845612 1.481492
H  -2.402077 4.719774 0.8727
H  -3.336754 -4.27088 1.196526
H  -2.284256 -4.663169 -0.206012
H  -4.013208 -5.116397 -0.22739
