program: Gaussian 09
title: 000246640
version: EM64L-G09RevD.01
frameworkgroup: C1[X(C20H24O)]
method: RPBEPBE
basis: SDD
operation: Freq
keyword: #pfreq=noraman
keyword: PBEPBE/SDD
title: #p freq=noraman PBEPBE/SDD
converged: YES YES NO NO
title: Mulliken charges:
elementType: O C C C C C C C C C C C C C C C C C C C C H H H H H H H H H H H H H H H H H H H H H H H H
charge: -0.301323 -0.107226 0.286246 -0.604657 0.092654 -0.385771 -0.737096 -0.732964 -0.734377 0.410659 0.400543 -0.392513 -0.376937 -0.381918 -0.382898 -0.255855 -0.227862 -0.224896 -0.243620 -0.243287 -0.245689 0.250133 0.236105 0.238167 0.210788 0.207477 0.214612 0.211502 0.222179 0.214191 0.212252 0.212411 0.222305 0.210996 0.213336 0.225167 0.265192 0.259585 0.218400 0.222091 0.223559 0.222786 0.222867 0.226006 0.226678
chargesum: 0.00000
title: Mulliken charges with hydrogens summed into heavy atoms:
elementType: O C C C C C C C C C C C C C C C C C C C C
charge: -0.301323 0.142906 0.286246 -0.130385 0.092654 0.032494 -0.088803 -0.094110 -0.087740 0.410659 0.400543 -0.167346 -0.111746 -0.122333 -0.164497 -0.033764 -0.004303 -0.002110 -0.020753 -0.017281 -0.019011
polarizability: 2.11601617e+02 -1.37197284e+01 2.16038267e+02 4.94543685e+00 -6.80165005e+00 1.95588172e+02
1716.lowfreq: -10.0132 -6.9353 -0.0004 0.0004 0.0006 4.1529 18.2091 32.9931 41.4281
frequency: 17.1457 32.9751 41.3056 45.3703 57.7451 75.7001 106.2489 167.1055 188.5547 208.9753 216.9362 233.6666 251.4786 257.8495 264.7974 285.1048 312.1929 323.8843 342.5116 364.1130 377.1869 400.1323 405.1783 427.0485 467.6067 494.7130 509.9412 522.5209 572.6796 608.6302 615.6080 616.0984 660.3585 700.7325 709.4330 722.1713 753.6021 759.8492 781.5358 840.8335 849.6455 855.5543 856.7247 909.1681 913.8774 923.0931 925.4155 931.2725 936.2004 940.4839 962.5698 973.9935 979.7894 986.8858 989.2883 990.9245 993.9420 999.4423 1008.2822 1020.6427 1026.7000 1031.5544 1048.2642 1073.8157 1081.2010 1095.4080 1103.2263 1143.9634 1169.3065 1171.2889 1171.8793 1184.3488 1190.4829 1206.0529 1218.5831 1230.4911 1233.7283 1256.2718 1281.9557 1306.5651 1313.8177 1320.6454 1327.8214 1350.7128 1372.6335 1375.9251 1378.2607 1381.4343 1403.1690 1429.6900 1435.2056 1455.8281 1460.9522 1465.6061 1468.5259 1474.7571 1479.3599 1481.6574 1487.0181 1492.8209 1496.2615 1587.8843 1591.8040 1607.2692 1613.2881 2965.7742 2968.9791 2972.5934 2978.2683 2988.9597 3019.6026 3044.0128 3061.2126 3063.1152 3063.9749 3068.2958 3071.6567 3075.3144 3089.6685 3116.7574 3118.3802 3125.0303 3127.3177 3138.0911 3139.9286 3153.4039 3155.9951 3164.4650 3170.4150
redmass: 3.0966 3.5653 4.1752 3.6860 4.3176 2.7397 3.4738 3.0503 3.8140 1.5308 2.0697 3.1651 1.5545 1.8627 1.8840 1.4691 2.4820 4.5664 2.6190 3.0604 2.5565 2.8202 2.8731 3.0123 3.3772 2.8673 3.2956 2.5662 3.2197 4.4940 6.4054 6.3602 6.1536 1.8038 1.8406 3.6515 1.8262 3.5417 2.2344 2.7259 1.2783 2.6146 1.2806 2.4434 1.4896 1.6470 1.7049 1.5829 1.5529 1.5080 4.2174 1.3853 1.3766 1.5574 5.7803 5.2973 1.3203 1.3377 1.5268 2.6178 2.0866 2.0744 2.4582 1.8233 1.7889 2.6672 2.2022 1.4177 1.0900 1.1914 1.2172 1.1273 1.1291 2.2241 2.4400 2.7467 1.8493 3.1348 1.7639 1.3518 1.3437 1.3386 1.2360 1.4429 1.2046 7.3876 1.2374 7.5237 1.2111 2.1957 2.2471 1.0964 1.0532 1.0487 1.0503 2.2050 1.0784 2.1999 1.0598 1.0739 1.0620 6.1919 6.2659 6.1224 6.0786 1.0349 1.0357 1.0770 1.0413 1.0577 1.0597 1.1078 1.1001 1.1001 1.0994 1.0988 1.0980 1.0983 1.1035 1.0849 1.0846 1.0873 1.0879 1.0932 1.0936 1.0952 1.0976 1.0993 1.0976
irintensity: 0.3084 0.9324 0.1130 0.0443 0.0195 1.4521 0.9941 1.1696 1.1684 0.8787 0.6620 0.0691 0.3112 0.2990 2.4587 1.0454 0.0094 2.7584 1.0731 0.0804 0.1213 0.3552 0.1308 0.6182 2.4812 0.7853 7.5442 3.7733 3.9302 26.0515 0.1906 0.1456 10.6011 32.3782 67.8057 31.1967 39.0805 0.9820 28.8360 2.9782 0.4117 5.2457 0.3989 5.9058 2.8942 2.1225 2.2702 10.9467 3.5386 2.4911 94.3524 0.0958 0.0889 3.5662 0.1768 0.2528 0.2491 1.0912 1.6870 14.0225 13.9026 6.6771 16.3191 2.4393 2.5021 1.6290 10.6112 1.0868 3.4290 2.9782 4.6736 1.9654 2.4790 7.4093 8.8210 4.6625 13.4730 42.5464 23.6424 1.5198 4.5487 0.8118 1.0505 2.3250 24.2992 0.4613 25.8516 2.0065 18.1352 2.3704 15.8633 5.2676 0.1234 0.0387 0.6311 21.3716 9.8228 10.4233 9.5770 12.3519 22.6906 0.0947 2.2973 9.6286 4.2311 27.7094 27.4647 27.5002 10.4365 82.6179 12.1338 34.5831 1.0603 11.4455 8.3073 59.8895 123.0129 51.2266 23.5272 7.9039 3.5756 2.6477 5.6784 21.9156 45.7151 21.7591 32.8572 21.6138 8.7386
temp: 298.150 k
press: 1.00000 atm
elementType: 8 6 6 6 6 6 6 6 6 6 6 6 6 6 6 6 6 6 6 6 6 1 1 1 1 1 1 1 1 1 1 1 1 1 1 1 1 1 1 1 1 1 1 1 1
symmnumber: 1
zpe: 1004895.2 jmol-1
zpe.correction: 0.382744 hartree
zpe.thermalcorrener: 0.402582 hartree
zpe.thermalcorrenthalpy: 0.403526 hartree
zpe.thermalcorrgfe: 0.333243 hartree
zpe.sumelectzpe: -850.198490 hartree
zpe.sumelectthermal: -850.178652 hartree
zpe.sumelectthermalent: -850.177708 hartree
zpe.sumelectthermalfe: -850.247992 hartree
dipole: -1.6988 0.2611 1.2849
dipole: 2.1459
quadrupole: -121.7793 -123.1944 -120.0751
quadrupole: -0.9233 1.6997 -2.7787
quadrupole: -0.0964 -1.5115 1.6078 -0.9233 1.6997 -2.7787
hfenergy: -850.5812344 hartree
pointgroup: C01 [X(C20H24O1)]
dipole: -0.6815904 -0.1377836 -0.4787892 debye
polarizability: 210.9062923|13.1406138|215.6060525|-6.0067507|-8.3184442|196.7157118 unknown
InChI: InChI=1S/C20H24O/c1-19(2,3)18-14-20(21-15-18,16-10-6-4-7-11-16)17-12-8-5-9-13-17/h4-13,18H,14-15H2,1-3H3
charge 0 multiplicity 1
45 atoms
O  -0.259205 0.494319 1.590088
C  -2.215944 0.087653 0.176987
C  -3.624899 0.665127 -0.191597
C  -1.019151 0.594822 -0.669563
C  0.215462 0.231437 0.200106
C  -1.738735 0.361003 1.629017
C  -4.672014 0.076514 0.795959
C  -3.679508 2.214848 -0.122685
C  -3.989713 0.213615 -1.632456
C  1.444663 1.117234 -0.037158
C  0.596858 -1.264644 0.055859
C  1.750782 1.617019 -1.327166
C  0.635217 -2.109875 1.190569
C  2.316371 1.417929 1.039424
C  0.93498 -1.806245 -1.211101
C  2.907676 2.400333 -1.540431
C  0.989834 -3.472399 1.061236
C  3.470183 2.20326 0.828007
C  1.286409 -3.167152 -1.342878
C  3.773647 2.695097 -0.463381
C  1.313055 -4.008479 -0.205667
H  -2.279321 -1.011655 0.040403
H  -0.990597 0.125643 -1.666404
H  -1.058979 1.692013 -0.791284
H  -2.13534 1.309559 2.03597
H  -2.000295 -0.463505 2.31834
H  -4.651917 -1.029951 0.784856
H  -5.692785 0.400214 0.518737
H  -4.485802 0.411099 1.833583
H  -3.014949 2.684807 -0.870052
H  -3.395549 2.599366 0.874326
H  -4.708807 2.562652 -0.3307
H  -3.291821 0.636585 -2.3782
H  -5.00963 0.549559 -1.898352
H  -3.960041 -0.888925 -1.723469
H  1.084079 1.406965 -2.171703
H  0.394801 -1.681882 2.169028
H  2.070112 1.047993 2.038984
H  0.941187 -1.163745 -2.100014
H  3.12968 2.781369 -2.543859
H  1.015639 -4.113785 1.949896
H  4.133184 2.432437 1.670214
H  1.545357 -3.569388 -2.329085
H  4.670928 3.302738 -0.626631
H  1.58809 -5.064473 -0.30655
