program: Gaussian 09
title: 000246628
version: EM64L-G09RevD.01
frameworkgroup: C1[X(C19H14O3)]
method: RPBEPBE
basis: SDD
operation: Freq
keyword: #pfreq=noraman
keyword: PBEPBE/SDD
title: #p freq=noraman PBEPBE/SDD
converged: YES YES NO NO
title: Mulliken charges:
elementType: O O O C C C C C C C C C C C C C C C C C C C H H H H H H H H H H H H H H
charge: -0.198733 -0.427873 -0.226275 0.268794 0.183045 0.226922 0.387154 -0.000566 0.074690 0.314537 -0.399600 -0.364128 -0.451809 -0.375199 -0.443596 -0.244201 -0.431038 -0.223928 -0.258250 -0.244703 -0.806345 0.063029 0.272157 0.274068 0.243117 0.263314 0.239769 0.234991 0.240805 0.236074 0.231298 0.230846 0.234363 0.220987 0.271812 0.384472
chargesum: 0.00000
title: Mulliken charges with hydrogens summed into heavy atoms:
elementType: O O O C C C C C C C C C C C C C C C C C C C
charge: -0.198733 -0.043401 -0.226275 0.268794 0.183045 0.226922 0.387154 -0.000566 0.074690 0.314537 -0.127442 -0.090060 -0.208692 -0.111885 -0.203826 -0.009210 -0.190233 0.012147 -0.026952 -0.013857 -0.079183 0.063029
polarizability: 2.84474729e+02 4.05586256e+00 2.13882049e+02 -1.19073777e+01 -1.09497017e+01 1.60777702e+02
1716.lowfreq: -3.3269 0.0003 0.0008 0.0008 5.1706 7.5433 26.8350 33.6733 47.5823
frequency: 26.8142 33.6602 47.5763 69.3647 91.2189 115.9791 127.6934 155.7673 168.1703 174.4868 188.7805 217.6039 229.3303 257.5057 315.6792 335.3991 351.5937 395.6414 411.8937 422.1290 467.0622 471.9815 500.4335 511.2903 520.2558 525.6433 555.2889 576.0552 604.6986 625.5115 636.8215 657.5992 686.0202 731.9468 738.7210 754.1601 780.6751 787.1674 789.1093 798.2540 812.0669 825.8834 852.8911 885.2799 924.2005 936.3625 953.4902 968.7742 991.2454 993.3326 995.7581 999.2095 1008.9278 1027.9131 1049.3885 1056.1715 1086.5350 1098.5152 1150.7165 1155.9587 1173.0880 1180.0859 1187.4333 1222.2373 1237.0623 1253.8756 1265.5938 1294.7289 1296.9403 1368.0780 1370.0306 1402.6772 1406.9656 1412.0992 1432.5184 1439.4964 1449.1842 1452.5237 1462.6355 1480.0559 1515.5060 1541.2506 1581.4484 1585.6227 1591.1595 1593.5300 1629.4721 1652.2790 2991.4155 3074.0921 3099.2112 3122.8779 3126.2183 3131.1163 3137.6279 3146.1118 3146.9943 3156.8139 3164.8007 3165.5554 3173.3519 3521.5752
redmass: 7.1461 5.4785 4.9658 5.3023 6.1121 2.4159 1.3912 7.0264 4.9429 5.2248 5.0697 3.1708 4.2340 4.6035 8.3783 5.2712 5.4059 4.1133 3.9575 3.8675 4.0500 3.3756 3.9965 4.9023 3.7441 6.2639 3.9406 1.5566 3.8109 5.3942 3.9080 5.4573 4.3154 2.2615 5.7791 1.9014 2.3164 2.9587 2.7024 3.4679 2.1976 1.7781 4.6982 1.7659 1.3768 1.4838 3.2346 1.4234 1.4541 1.3832 2.0890 1.7573 2.4540 2.4656 1.5838 2.5418 2.1196 2.1894 1.5126 1.7430 1.2422 1.1386 1.2813 2.0157 1.9158 1.7661 2.0512 2.4413 2.7199 8.2801 2.6205 2.5962 1.2377 6.4888 2.4791 2.4762 2.6493 2.3713 1.0592 1.1841 3.7202 10.9453 7.2066 7.4157 5.3552 5.9939 6.4400 9.1622 1.0376 1.0960 1.1005 1.0868 1.0874 1.0870 1.0900 1.0912 1.0915 1.0959 1.0986 1.0992 1.0975 1.0640
irintensity: 0.0370 1.3826 0.2342 0.6287 0.4449 1.8450 0.5163 3.5183 0.8610 3.3262 4.2503 1.7991 1.3317 0.9039 4.1010 7.7877 0.2540 2.1981 3.9314 4.8900 0.8625 0.9273 9.9722 20.1853 7.7250 3.0486 9.5316 60.4063 26.1517 13.7710 14.3619 4.0758 55.8689 7.5483 4.1736 5.1839 25.4664 29.8929 41.4859 54.0133 30.5275 25.9689 13.8913 7.1352 0.5595 0.7044 8.6833 0.9631 17.6250 8.2408 95.0415 60.5638 1.5718 6.9861 9.0469 30.5875 8.7624 37.6691 13.8324 40.2698 3.9390 4.1428 4.6803 2.7692 5.7184 43.5373 81.7563 160.2263 30.2027 10.3298 6.5368 3.7679 19.4430 4.2374 44.7133 1.0165 10.9337 26.0002 14.6568 7.1754 20.9769 151.5207 20.7229 9.0806 8.5664 6.6104 0.7701 272.3789 19.4441 12.7326 15.5590 0.9189 3.9391 4.6389 13.5973 13.9115 13.3307 29.1147 22.5562 16.5228 10.9530 34.7731
temp: 298.150 k
press: 1.00000 atm
elementType: 8 8 8 6 6 6 6 6 6 6 6 6 6 6 6 6 6 6 6 6 6 6 1 1 1 1 1 1 1 1 1 1 1 1 1 1
symmnumber: 1
zpe: 719332.1 jmol-1
zpe.correction: 0.273979 hartree
zpe.thermalcorrener: 0.292408 hartree
zpe.thermalcorrenthalpy: 0.293352 hartree
zpe.thermalcorrgfe: 0.226566 hartree
zpe.sumelectzpe: -956.605554 hartree
zpe.sumelectthermal: -956.587125 hartree
zpe.sumelectthermalent: -956.586180 hartree
zpe.sumelectthermalfe: -956.652966 hartree
dipole: -2.4788 3.9589 1.1908
dipole: 4.8203
quadrupole: -115.1039 -126.7435 -118.0639
quadrupole: 11.6515 0.1099 -1.7875
quadrupole: 4.8665 -6.7731 1.9065 11.6515 0.1099 -1.7875
hfenergy: -956.8795328 hartree
pointgroup: C01 [X(C19H14O3)]
dipole: -0.967545 0.0150487 -1.6309897 debye
polarizability: 281.364015|-22.3098078|176.4486815|2.8136405|24.8549807|201.321783 unknown
InChI: InChI=1S/C19H14O3/c1-12-6-4-11-16(17(12)19(21)22)18(20)15-10-5-8-13-7-2-3-9-14(13)15/h2-11,21H,1H3
charge 0 multiplicity 1
36 atoms
O  0.755865 0.659194 2.365543
O  1.610938 -1.96701 1.394234
O  3.756117 -1.223081 1.890832
C  -1.191242 0.741533 0.946816
C  -1.919366 -0.051959 -0.020977
C  1.236917 0.569355 0.012611
C  -3.334227 0.216477 -0.208899
C  0.287921 0.613009 1.187021
C  2.464767 -0.154497 0.086526
C  3.453143 -0.017158 -0.930897
C  -1.870651 1.692307 1.727661
C  -1.329148 -1.132822 -0.759706
C  -3.974369 1.230103 0.576945
C  0.981846 1.406714 -1.099699
C  -4.078586 -0.55541 -1.162165
C  -3.260053 1.944682 1.541325
C  3.170919 0.843261 -2.023914
C  1.949974 1.543664 -2.11563
C  -2.083385 -1.872092 -1.67421
C  -3.465773 -1.575589 -1.890483
C  4.771591 -0.767987 -0.884635
C  2.708676 -1.1061 1.217878
H  -1.302854 2.252873 2.477572
H  -0.284593 -1.401053 -0.580464
H  -5.041617 1.42597 0.417762
H  0.040608 1.962775 -1.151123
H  -5.144525 -0.337102 -1.298863
H  -3.758033 2.706727 2.149668
H  3.922363 0.954464 -2.813987
H  1.75782 2.199704 -2.971275
H  -1.61498 -2.695108 -2.224941
H  -4.041578 -2.162348 -2.614408
H  4.619824 -1.860806 -0.8129
H  5.367526 -0.563595 -1.789642
H  5.359391 -0.47891 0.003399
H  1.761575 -2.528285 2.202225
