program: Gaussian 09
title: 000246627
version: EM64L-G09RevD.01
frameworkgroup: C1[X(C18H21NO)]
method: RPBEPBE
basis: SDD
operation: Freq
keyword: #p
keyword: freq=noraman
keyword: PBEPBE/SDD
title: #p freq=noraman PBEPBE/SDD
converged: YES YES NO NO
title: Mulliken charges:
elementType: O N C C C C C C C C C C C C C C C C C C H H H H H H H H H H H H H H H H H H H H H
charge: -0.270512 -0.608325 -0.081369 -0.360877 -0.580539 0.371805 -0.750030 0.496755 0.193628 0.254120 -0.373816 -0.406316 -0.440325 -0.397858 -0.856745 -0.262758 -0.243375 -0.231739 -0.234652 -0.245353 0.263721 0.220131 0.196786 0.233084 0.186381 0.243226 0.242317 0.271281 0.227529 0.228588 0.255878 0.241257 0.213338 0.236325 0.227228 0.330735 0.315007 0.226187 0.221234 0.222766 0.225282
chargesum: 0.00000
title: Mulliken charges with hydrogens summed into heavy atoms:
elementType: O N C C C C C C C C C C C C C C C C C C
charge: -0.270512 0.037418 0.182353 -0.140746 -0.150669 0.371805 -0.078106 0.496755 0.193628 0.254120 -0.102535 -0.178786 -0.211737 -0.141981 -0.165825 -0.035531 -0.017188 -0.010505 -0.011886 -0.020071
polarizability: 2.44985017e+02 -5.81616726e+00 1.59246636e+02 -7.55905737e+00 1.62951941e+01 1.87956266e+02
1716.lowfreq: -13.2632 -6.8744 -0.9173 -0.0007 -0.0006 0.0004 16.1299 30.3322 35.3351
frequency: 15.2295 30.3095 35.2890 39.6633 45.5700 71.2095 100.6692 134.8199 157.1009 158.3855 175.7562 199.7252 230.6888 244.7782 279.8798 285.6531 341.7064 349.9471 402.1892 404.6794 407.4950 444.8955 461.7895 481.5818 500.6996 511.3977 540.0200 569.3689 581.4100 614.7233 617.7787 627.7790 692.7127 706.2782 736.0171 752.4808 768.0758 787.6025 801.6131 844.6774 854.6092 860.2446 874.8816 883.4528 898.7016 923.7302 948.1627 963.6239 977.3480 982.6205 989.6993 993.0478 994.1631 1026.6883 1037.6447 1041.4950 1048.5380 1057.6791 1087.0181 1101.6735 1109.4764 1138.8736 1170.6419 1174.2885 1181.5981 1187.6705 1190.9231 1216.7232 1225.8498 1240.5455 1248.4567 1292.2541 1308.4277 1314.5026 1330.8510 1337.5110 1348.9193 1375.4044 1382.5399 1391.3548 1396.5823 1431.5380 1440.3239 1465.9111 1471.8063 1477.3447 1479.4231 1483.2905 1483.6952 1486.1943 1583.3216 1590.2927 1592.0746 1611.5412 1613.8650 1635.3716 2968.1816 2969.7202 2974.8780 2992.2146 3010.5405 3036.7319 3043.0682 3064.8632 3081.4887 3088.9197 3113.0075 3115.7665 3116.4400 3126.9330 3129.9951 3140.3893 3141.2707 3159.6746 3159.9836 3511.8690 3668.1344
redmass: 4.1122 3.9944 4.5710 4.3426 4.1790 3.4877 4.0906 6.0281 1.3236 2.7579 2.4302 4.7318 1.3646 2.3025 3.8841 3.1952 2.9853 2.6559 2.9745 2.8274 2.3066 2.9042 2.9403 2.8694 1.7434 1.9016 4.2710 2.1017 3.3915 3.2429 4.7588 3.4000 3.8636 1.8233 2.6377 1.7161 1.4970 4.6118 4.0985 2.8757 1.4590 1.9955 1.8458 1.5375 1.6749 1.5116 1.7019 1.6359 1.3820 1.6220 6.0748 1.3329 1.3136 2.2033 1.6200 1.7228 2.1917 1.7534 2.0333 1.8227 2.6520 2.0759 1.0564 1.1876 1.5759 1.1501 1.2245 2.5629 2.6098 1.5460 1.4560 1.4928 1.4094 1.4198 1.5872 1.3136 2.0538 5.0839 7.1974 1.2152 1.2604 2.0020 2.1575 1.1111 1.0734 1.3027 1.1644 1.4078 1.5639 1.5153 3.7701 2.1074 4.4309 5.9564 6.0627 2.9628 1.0394 1.0405 1.0602 1.0807 1.0830 1.1006 1.0956 1.0947 1.0977 1.0996 1.0860 1.0866 1.0872 1.0882 1.0913 1.0938 1.0960 1.1014 1.1008 1.0447 1.1042
irintensity: 1.5462 2.2181 7.1612 1.9675 4.9660 0.0373 0.3410 3.4421 2.3287 2.8139 0.1071 0.0738 0.2939 2.9567 2.0376 7.7815 2.4822 1.4791 0.4183 0.0209 1.0734 1.4508 9.1457 19.5894 37.0585 99.9676 3.5010 62.3935 6.8498 42.5929 12.7928 12.6261 20.4933 49.2970 12.2416 76.8068 37.4421 1.1203 3.8553 2.7781 0.5530 0.2675 0.9933 4.4973 4.6320 2.8133 4.6339 0.5348 0.0968 1.8118 0.0093 0.0934 0.2093 7.9449 6.6758 5.8993 7.8678 5.1081 3.7050 8.0288 2.0929 21.5866 0.1948 1.1995 4.1605 2.7540 9.3566 3.1000 11.4248 18.7900 20.9982 22.3065 7.4305 0.4413 43.8221 9.3368 89.8495 5.2669 0.3585 14.9534 11.8882 1.4375 7.1677 3.5479 5.4088 13.4466 23.1203 33.4759 10.3673 11.9666 19.8761 38.5200 4.9592 5.3025 12.6463 252.6617 28.1024 23.3496 28.7986 8.3497 20.0244 16.9644 24.9624 35.0945 25.9286 32.1976 8.8671 9.8945 1.4787 6.3242 13.3622 19.7432 43.1659 34.4035 27.6879 31.0722 21.4964
temp: 298.150 k
press: 1.00000 atm
elementType: 8 7 6 6 6 6 6 6 6 6 6 6 6 6 6 6 6 6 6 6 1 1 1 1 1 1 1 1 1 1 1 1 1 1 1 1 1 1 1 1 1
symmnumber: 1
zpe: 901506.6 jmol-1
zpe.correction: 0.343366 hartree
zpe.thermalcorrener: 0.362823 hartree
zpe.thermalcorrenthalpy: 0.363767 hartree
zpe.thermalcorrgfe: 0.293021 hartree
zpe.sumelectzpe: -827.060382 hartree
zpe.sumelectthermal: -827.040924 hartree
zpe.sumelectthermalent: -827.039980 hartree
zpe.sumelectthermalfe: -827.110726 hartree
dipole: 2.4550 -0.6096 -3.1649
dipole: 4.0516
quadrupole: -112.5591 -119.0197 -109.3176
quadrupole: 4.2596 -6.7653 -3.5566
quadrupole: 1.0730 -5.3876 4.3146 4.2596 -6.7653 -3.5566
hfenergy: -827.4037473 hartree
pointgroup: C01 [X(C18H21N1O1)]
dipole: 0.9664379 0.0376703 1.2670701 debye
polarizability: 245.1274235|2.9031121|155.0222309|8.5601391|11.3194431|192.0382635 unknown
InChI: InChI=1S/C18H21NO/c1-13-8-6-7-11-16(13)17(18(19)20)14(2)12-15-9-4-3-5-10-15/h3-11,14,17H,12,19H2,1-2H3
charge 0 multiplicity 1
41 atoms
O  0.291945 -2.475615 -0.88021
N  1.527934 -3.001394 1.005086
C  -0.336412 0.137089 0.233039
C  0.980379 -0.616243 0.613237
C  -1.553672 -0.485239 0.987851
C  2.23341 0.007417 -0.024091
C  -0.236496 1.653443 0.503812
C  -2.896231 -0.030489 0.433449
C  0.887695 -2.098609 0.173699
C  3.22771 0.671864 0.756791
C  2.389611 -0.067208 -1.432984
C  4.345696 1.240272 0.092654
C  -3.738808 0.853334 1.153786
C  -3.327431 -0.489167 -0.840495
C  3.123706 0.801282 2.269992
C  3.507102 0.503855 -2.07679
C  4.493023 1.163443 -1.309534
C  -4.978824 1.273954 0.618961
C  -4.564691 -0.072397 -1.377982
C  -5.395932 0.81271 -0.65038
H  -0.495016 -0.027465 -0.850701
H  1.07875 -0.589185 1.716188
H  -1.477506 -0.223064 2.062652
H  -1.491673 -1.587471 0.910496
H  -0.070907 1.856153 1.580914
H  -1.175096 2.155548 0.210509
H  0.591495 2.113268 -0.062706
H  1.629228 -0.593742 -2.02159
H  5.11074 1.753596 0.688198
H  -3.422046 1.212417 2.141204
H  -2.688296 -1.18219 -1.402404
H  2.205866 1.337534 2.575428
H  3.109438 -0.183082 2.777829
H  3.985203 1.361649 2.671248
H  3.608197 0.432482 -3.1654
H  1.553438 -3.984109 0.732281
H  2.041536 -2.701748 1.831923
H  5.366926 1.61223 -1.79498
H  -5.617431 1.956852 1.191287
H  -4.884006 -0.439405 -2.360343
H  -6.357252 1.134835 -1.06662
