program: Gaussian 09
title: 000246639
version: EM64L-G09RevD.01
frameworkgroup: C1[X(C20H22O3)]
method: RPBEPBE
basis: SDD
operation: Freq
keyword: #pfreq=noraman
keyword: PBEPBE/SDD
title: #p freq=noraman PBEPBE/SDD
converged: YES YES NO NO
title: Mulliken charges:
elementType: O O O C C C C C C C C C C C C C C C C C C C C H H H H H H H H H H H H H H H H H H H H H H
charge: -0.204783 -0.256020 -0.242898 0.116867 0.132412 -0.047316 0.344937 0.336891 0.100102 0.304667 0.342079 0.478806 -0.612451 -0.623013 -0.430956 -0.440634 -0.814620 -0.876918 -0.844969 -0.813809 -0.815157 0.098835 -0.506558 0.238591 0.238786 0.235527 0.234576 0.222401 0.266258 0.216401 0.244199 0.225438 0.292867 0.263059 0.228843 0.235813 0.262945 0.223321 0.230245 0.225264 0.238913 0.225441 0.256518 0.238143 0.230957
chargesum: 0.00000
title: Mulliken charges with hydrogens summed into heavy atoms:
elementType: O O O C C C C C C C C C C C C C C C C C C C C
charge: -0.204783 -0.256020 -0.242898 0.116867 0.132412 -0.047316 0.344937 0.336891 0.100102 0.304667 0.342079 0.478806 -0.373859 -0.384228 -0.195429 -0.206058 -0.109560 -0.114415 -0.117254 -0.097298 -0.125538 0.098835 0.219060
polarizability: 3.09534955e+02 -4.34688409e+00 2.06407652e+02 1.40487110e+00 -7.08587169e+00 1.82330120e+02
1716.lowfreq: -24.1794 -2.7007 -0.0006 -0.0004 0.0004 4.3183 8.0507 29.5237 38.2807
frequency: -23.4788 29.4912 38.2604 43.5735 54.6172 82.0358 97.7986 112.7597 115.0320 125.0907 129.1092 143.1406 149.2550 153.3702 171.4005 180.6752 190.3937 206.7164 225.9558 244.5597 272.6038 272.6632 285.2459 300.3467 307.1820 328.5656 331.7471 372.7375 397.5225 415.3665 463.7600 476.5477 503.3260 527.2778 529.2708 543.4658 558.7066 570.7124 598.0115 627.8402 679.6251 699.4564 701.6431 747.5324 760.7688 783.9794 810.9403 827.3322 865.6591 869.4512 897.9443 934.6142 943.8782 951.5810 962.0076 969.9324 1016.8049 1020.2772 1024.2403 1033.5458 1041.6086 1044.4087 1046.8440 1050.0629 1051.7702 1054.3986 1109.2735 1114.0291 1150.4926 1155.3638 1183.1912 1202.4873 1244.7394 1255.5811 1265.3737 1276.2179 1308.9167 1353.1925 1355.6068 1391.5325 1395.3990 1401.8765 1402.1613 1404.1301 1408.9738 1416.3182 1422.1657 1437.2624 1451.5015 1460.0542 1460.7660 1463.4808 1465.1284 1467.5184 1470.3345 1471.3495 1473.8156 1475.4051 1479.7886 1482.3130 1498.9391 1532.5487 1571.7569 1573.9042 1599.0984 1609.4711 1615.0135 2974.7584 2978.6925 2985.6413 2987.0828 2988.4762 3005.8771 3056.1572 3062.4602 3069.0578 3071.3242 3073.0865 3082.0551 3083.3945 3085.0798 3087.6369 3092.4108 3109.8491 3115.3706 3119.3478 3120.2955 3144.5591 3150.7379
redmass: 1.0173 5.6932 4.1215 3.7551 3.8512 3.9233 3.4884 2.1443 1.7129 1.4960 1.3206 2.8117 1.2467 1.2633 3.5972 4.7780 2.9955 1.3588 1.8191 4.3069 5.3775 3.0131 3.4354 3.6778 4.3502 3.4484 2.9817 4.9359 4.9033 4.3050 4.2196 3.6127 3.3599 4.6159 3.2726 3.7249 4.3122 4.2069 4.7223 4.0005 5.9074 6.5626 4.9101 4.8463 5.3901 5.9623 5.3841 1.2910 3.0175 1.6769 1.3052 2.7077 3.2362 3.1602 1.3497 3.4906 1.6593 1.6956 1.5964 1.8877 1.5577 1.5954 1.5846 1.5570 1.7147 1.5782 1.8385 2.0811 1.5038 2.2244 1.5784 2.6545 2.2698 1.5817 3.0394 2.9211 6.7703 8.5658 7.1346 3.1586 1.2311 1.3879 1.2239 1.2444 1.4664 1.5348 1.3121 2.1541 1.0519 1.3765 1.0949 1.1596 1.3005 1.2396 1.1084 1.0558 1.1157 1.1331 1.1978 1.1554 1.1353 8.6236 5.7328 6.5019 7.7644 9.4237 5.7102 1.0385 1.0370 1.0370 1.0372 1.0367 1.0292 1.0949 1.0970 1.0973 1.0968 1.0966 1.0999 1.0997 1.1000 1.1003 1.1001 1.1046 1.0908 1.0918 1.0872 1.0969 1.1051
irintensity: 0.3271 3.1407 0.7752 1.2238 1.0363 1.3061 1.0030 1.4328 0.8234 0.1980 0.2168 2.4715 0.3414 0.5185 2.5904 1.7546 5.4531 0.1220 0.2141 1.1283 2.1037 5.3209 14.0959 4.8851 4.4558 3.2130 2.5320 6.9077 0.7319 4.5043 4.9602 5.3349 3.2633 0.7885 6.4180 3.4258 1.5360 3.6100 2.4462 10.1065 22.2152 2.3275 9.0682 0.1356 19.0215 5.2769 32.1842 22.4329 13.4635 10.9996 0.1894 6.6050 16.3947 7.4520 0.2434 21.5131 1.3027 25.5998 5.8857 20.5326 0.4285 4.5800 18.7492 6.3715 16.9150 11.6971 52.9170 82.6218 37.5757 15.2855 19.0745 52.9419 106.6919 5.5888 76.2823 127.2146 18.0076 1.3237 2.1582 31.1198 14.5271 29.0649 20.5347 5.1640 4.2341 8.5151 39.9000 68.8574 15.4055 2.2773 11.0232 7.8911 19.1705 7.7030 11.2062 10.8921 24.3625 29.3961 21.6056 21.5909 27.4816 138.5888 30.5216 39.6520 40.8192 124.1901 76.3899 34.8483 23.4341 27.8461 26.2704 22.0967 37.3053 20.3920 20.6272 10.8144 14.8172 19.3114 13.3666 23.1262 16.3222 20.1902 18.0523 19.1975 27.8829 18.8184 9.9728 30.9535 16.9554
temp: 298.150 k
press: 1.00000 atm
elementType: 8 8 8 6 6 6 6 6 6 6 6 6 6 6 6 6 6 6 6 6 6 6 6 1 1 1 1 1 1 1 1 1 1 1 1 1 1 1 1 1 1 1 1 1 1
symmnumber: 1
zpe: 955136.0 jmol-1
zpe.correction: 0.363792 hartree
zpe.thermalcorrener: 0.387323 hartree
zpe.thermalcorrenthalpy: 0.388267 hartree
zpe.thermalcorrgfe: 0.311044 hartree
zpe.sumelectzpe: -999.342028 hartree
zpe.sumelectthermal: -999.318497 hartree
zpe.sumelectthermalent: -999.317553 hartree
zpe.sumelectthermalfe: -999.394776 hartree
dipole: 0.0421 2.2068 -0.5737
dipole: 2.2805
quadrupole: -111.1373 -127.3680 -136.6256
quadrupole: 2.6181 2.5807 -0.3278
quadrupole: 13.9063 -2.3243 -11.5820 2.6181 2.5807 -0.3278
hfenergy: -999.7058199 hartree
pointgroup: C01 [X(C20H22O3)]
dipole: -0.0565636 0.8548945 0.2663893 debye
polarizability: 308.7257759|7.1024526|206.0098972|7.5512079|8.6594832|183.5370544 unknown
InChI: InChI=1S/C20H22O3/c1-11-9-14(4)16(15(5)10-11)19(21)17-12(2)7-8-13(3)18(17)20(22)23-6/h7-10H,1-6H3
charge 0 multiplicity 1
45 atoms
O  0.288003 -1.324199 -1.57429
O  3.470913 -1.630713 -0.320278
O  1.662653 -1.835618 1.124598
C  -1.593516 -0.354945 -0.412661
C  0.816662 0.702155 -0.422475
C  -0.152556 -0.3927 -0.82926
C  -2.602727 -0.66743 -1.38366
C  -1.966248 -0.063679 0.941208
C  2.110549 0.319044 0.044912
C  0.513239 2.07808 -0.648264
C  3.113923 1.285814 0.329513
C  -4.352529 -0.356048 0.33917
C  -3.960128 -0.640196 -0.99086
C  -3.338627 -0.078187 1.286207
C  1.524949 3.030961 -0.373191
C  2.789658 2.647363 0.113262
C  -2.274701 -1.009869 -2.828105
C  -0.949751 0.208608 2.039981
C  -0.818365 2.559474 -1.204277
C  4.485691 0.912179 0.8648
C  -5.814718 -0.382821 0.745113
C  2.354778 -1.135416 0.344313
C  3.73855 -3.076597 -0.116606
H  -4.73053 -0.8549 -1.742162
H  -3.620568 0.127568 2.326607
H  1.314432 4.092298 -0.550469
H  3.543718 3.413642 0.327381
H  -1.519324 -0.331454 -3.263908
H  -1.844276 -2.023462 -2.901079
H  -3.184946 -0.965636 -3.450893
H  -0.474471 1.200721 1.927098
H  -1.441741 0.185915 3.027575
H  -0.138657 -0.540959 2.039911
H  -1.645285 2.406772 -0.488013
H  -0.766407 3.636353 -1.439564
H  -1.099667 2.026491 -2.130231
H  5.062889 0.347215 0.112559
H  5.054943 1.816777 1.137748
H  4.415985 0.270799 1.762758
H  -6.472722 -0.080116 -0.088456
H  -6.120055 -1.403124 1.049514
H  -6.011141 0.286558 1.600899
H  2.878094 -3.666225 -0.473448
H  3.90944 -3.290017 0.952027
H  4.63699 -3.280678 -0.715403
