program: Gaussian 09
title: 000246636
version: EM64L-G09RevD.01
frameworkgroup: C1[X(C20H16N2O8)]
method: RPBEPBE
basis: SDD
operation: Freq
keyword: #p
keyword: freq=noraman
keyword: PBEPBE/SDD
title: #p freq=noraman PBEPBE/SDD
converged: YES YES NO NO
title: Mulliken charges:
elementType: O O O O O O O O N N C C C C C C C C C C C C C C C C C C C C H H H H H H H H H H H H H H H H
charge: -0.304607 -0.273809 -0.240246 -0.231502 -0.199788 -0.200830 -0.197886 -0.199441 0.027893 0.028128 0.213419 -0.705141 -0.704744 0.231900 0.223332 0.052714 -0.319529 -0.308802 0.388915 -0.350449 -0.344101 0.239505 0.024187 -0.382987 -0.317411 -0.307686 0.388639 -0.350067 -0.343709 0.211415 0.274314 0.227378 0.228968 0.231781 0.244757 0.224036 0.281094 0.279209 0.291591 0.289845 0.274081 0.255437 0.283172 0.283186 0.292987 0.290848
chargesum: 0.00000
title: Mulliken charges with hydrogens summed into heavy atoms:
elementType: O O O O O O O O N N C C C C C C C C C C C C C C C C C C C C
charge: -0.304607 -0.273809 -0.240246 -0.231502 -0.199788 -0.200830 -0.197886 -0.199441 0.027893 0.028128 0.213419 0.025520 -0.004170 0.231900 0.223332 0.052714 -0.038435 -0.029593 0.388915 -0.058858 -0.054255 0.239505 0.024187 0.146531 -0.034239 -0.024499 0.388639 -0.057079 -0.052861 0.211415
polarizability: 3.64258684e+02 -3.08899699e+01 2.66976680e+02 -3.96754606e+01 -9.30308463e+00 2.08414640e+02
1716.lowfreq: -5.9023 -3.6926 -0.6941 -0.0002 0.0005 0.0008 3.7824 9.0057 12.8635
frequency: 2.0818 8.8345 12.7811 21.6964 24.9597 42.8396 49.9084 64.2771 66.0909 79.0799 80.9317 91.9241 107.6627 116.4366 131.4556 174.6680 191.5690 203.5880 207.7116 229.8337 246.1901 253.2960 254.9382 263.3749 275.7404 291.2186 307.7152 321.1029 344.6127 367.4046 405.3448 409.7313 409.7833 422.1066 457.0184 458.2179 484.4990 486.8566 509.8121 516.5279 533.0916 552.4659 561.9202 622.9700 623.3313 648.8555 652.4258 663.0768 675.6607 684.4394 685.9617 691.7224 748.9657 764.6250 764.7791 768.8132 776.1415 796.5939 819.8920 863.2404 865.6437 866.2231 888.1572 890.1977 914.2755 933.0790 991.4265 1003.4484 1003.7205 1005.1173 1005.7398 1009.2179 1011.5152 1012.4985 1040.9664 1051.4278 1077.2333 1089.5175 1089.5394 1108.5234 1109.7688 1132.0389 1175.7487 1177.1263 1190.0701 1212.3556 1215.7985 1236.9252 1239.8655 1248.4635 1273.8074 1292.1999 1293.9598 1344.0630 1367.9626 1368.9265 1374.5202 1393.4740 1404.7051 1404.8305 1414.1256 1415.0786 1434.7820 1451.1399 1464.7270 1468.8840 1473.3410 1474.7321 1489.4222 1590.1060 1592.1455 1608.6018 1609.5901 1620.5864 1630.2956 2278.6464 3001.6378 3005.0883 3020.6316 3093.8515 3096.5557 3110.0011 3117.0555 3132.4701 3164.3814 3165.7964 3176.5338 3177.2493 3188.2376 3188.7974 3194.2807 3194.6988
redmass: 8.6135 7.1073 6.2045 7.3497 6.8454 9.9991 7.6896 6.8432 6.1661 6.3988 6.5088 7.9676 5.0082 5.7771 4.6455 6.1264 5.4810 1.0734 6.9705 6.1983 2.9384 1.4916 5.2298 6.9203 5.8424 7.0789 3.1582 4.4519 3.3041 4.1570 5.4446 2.8862 2.8825 6.6237 4.1684 4.2231 9.3322 9.0693 6.5507 6.3824 5.5226 5.5384 5.1516 7.1118 7.1264 5.9305 6.1787 5.9514 7.2375 4.5802 3.9818 5.6267 6.5674 5.1013 5.1477 4.7248 9.7020 8.2407 7.5578 1.2471 1.2815 6.9774 1.6717 1.6682 2.7438 1.4982 2.1532 1.3473 3.4001 3.0728 1.3442 1.3394 1.3665 1.3693 4.0074 4.6504 2.5543 3.3111 3.2996 1.3121 1.3127 1.9344 1.2638 1.2324 3.9972 6.5443 6.9194 1.4329 2.3231 5.2516 3.4387 1.2606 1.2597 1.3503 7.7360 7.8050 1.1950 1.1991 7.7411 7.8794 4.7314 4.6150 1.1030 1.0490 1.0506 1.0573 2.3976 2.4188 1.0568 8.9687 8.5972 6.3502 6.3403 10.5706 10.5329 11.8517 1.0358 1.0350 1.0586 1.1036 1.1001 1.1004 1.1013 1.1001 1.0902 1.0902 1.0890 1.0891 1.0957 1.0959 1.0972 1.0974
irintensity: 0.4514 0.0379 0.4093 0.2345 0.1537 0.2161 0.2171 0.3417 0.3859 1.6086 2.0665 6.2648 1.5691 0.1978 4.1809 2.8214 4.5490 0.3164 2.7035 4.4062 0.7559 0.5538 2.1992 1.1496 0.3895 15.5356 11.9191 6.5343 9.1118 13.9541 0.7725 0.0056 0.0083 5.4929 0.7843 0.8951 14.6167 4.3943 0.7284 4.7867 6.9225 7.2032 0.3820 0.7705 0.4589 0.9156 0.1102 5.2768 5.9380 57.9013 45.9082 27.3492 20.1505 7.1352 5.5353 45.4126 34.3452 19.5093 32.0228 0.4947 3.2942 96.4176 50.4881 52.6615 59.2003 0.4848 30.7271 0.8787 101.3704 44.0509 0.5229 1.2702 0.0044 0.0229 474.9081 268.4605 20.4364 14.9536 8.5586 16.1991 13.3016 165.0322 6.0377 2.8432 101.4186 628.9478 297.3996 63.0873 96.6388 127.9922 88.6314 1.2536 0.5958 30.8211 84.7883 84.6942 30.1044 17.0093 12.8476 12.0594 62.9223 64.1303 31.0725 12.8970 0.4558 5.2812 2.0306 3.0879 20.2185 43.7160 30.7871 1.9660 1.9021 105.0659 135.1163 1.0646 11.0093 16.1393 17.2257 3.3497 14.5283 36.7059 18.1272 5.6093 1.4709 1.3775 1.1607 1.0320 0.4805 0.6888 0.5738 0.6271
temp: 298.150 k
press: 1.00000 atm
elementType: 8 8 8 8 8 8 8 8 7 7 6 6 6 6 6 6 6 6 6 6 6 6 6 6 6 6 6 6 6 6 1 1 1 1 1 1 1 1 1 1 1 1 1 1 1 1
symmnumber: 1
zpe: 859219.9 jmol-1
zpe.correction: 0.327260 hartree
zpe.thermalcorrener: 0.355592 hartree
zpe.thermalcorrenthalpy: 0.356536 hartree
zpe.thermalcorrgfe: 0.259855 hartree
zpe.sumelectzpe: -1480.671564 hartree
zpe.sumelectthermal: -1480.643232 hartree
zpe.sumelectthermalent: -1480.642288 hartree
zpe.sumelectthermalfe: -1480.738968 hartree
dipole: -0.3294 5.9893 0.4176
dipole: 6.0129
quadrupole: -256.9615 -176.3658 -165.6397
quadrupole: 8.9314 15.1902 5.9147
quadrupole: -57.3058 23.2898 34.0160 8.9314 15.1902 5.9147
hfenergy: -1480.9988233 hartree
pointgroup: C01 [X(C20H16N2O8)]
dipole: -0.1696327 1.3475637 -1.936911 debye
polarizability: 364.9031353|-49.576132|215.1397271|4.4682103|-20.4520724|259.6071424 unknown
InChI: InChI=1S/C20H16N2O8/c1-20(2,30-19(24)15-6-10-17(11-7-15)22(27)28)12-3-13-29-18(23)14-4-8-16(9-5-14)21(25)26/h4-11H,13H2,1-2H3
charge 0 multiplicity 1
46 atoms
O  2.466788 1.70293 -0.513957
O  -2.779867 -0.470617 -1.564927
O  3.063545 0.171705 -2.187809
O  -2.056981 -1.939764 0.10553
O  8.082328 -2.178414 2.165421
O  7.423404 -0.660585 3.735543
O  -8.199842 -0.752014 3.372068
O  -8.772019 0.728642 1.733707
N  7.323049 -1.219581 2.576727
N  -7.961724 -0.117615 2.274284
C  1.314424 2.28774 -1.337771
C  1.89187 2.992316 -2.585304
C  0.681568 3.289087 -0.348771
C  4.27589 0.203742 -0.075375
C  3.228215 0.662951 -1.04579
C  0.353824 1.223227 -1.679514
C  5.135788 -0.848821 -0.48408
C  4.421225 0.785165 1.210989
C  6.263901 -0.725988 1.654959
C  6.138322 -1.322529 0.38096
C  5.42098 0.321404 2.086555
C  -4.240115 -0.866671 0.292976
C  -0.504817 0.37579 -1.932514
C  -1.470647 -0.665229 -2.279002
C  -4.543181 -1.538175 1.506141
C  -5.164998 0.052951 -0.266472
C  -6.667248 -0.37872 1.586241
C  -5.763457 -1.29808 2.162846
C  -6.389395 0.302694 0.381174
C  -2.925116 -1.163004 -0.356021
H  2.341843 2.266407 -3.278227
H  1.08123 3.528303 -3.109118
H  2.654197 3.727019 -2.272637
H  1.428623 4.049591 -0.065541
H  0.333766 2.770735 0.559215
H  -0.178742 3.790362 -0.82339
H  4.999588 -1.27983 -1.480662
H  3.749104 1.592149 1.511942
H  6.815044 -2.131698 0.095629
H  5.55905 0.747283 3.083474
H  -1.075432 -1.664665 -2.020293
H  -1.744547 -0.626688 -3.345754
H  -3.810685 -2.240543 1.915537
H  -4.915269 0.561758 -1.200524
H  -6.026753 -1.799257 3.097529
H  -7.12393 1.004141 -0.022094
