program: Gaussian 09
title: 000246622
version: EM64L-G09RevD.01
frameworkgroup: C1[X(C18H11ClO3)]
method: RPBEPBE
basis: SDD
operation: Freq
keyword: #p
keyword: freq=noraman
keyword: PBEPBE/SDD
title: #p freq=noraman PBEPBE/SDD
converged: YES YES NO NO
title: Mulliken charges:
elementType: Cl O O O C C C C C C C C C C C C C C C C C C H H H H H H H H H H H
charge: -0.041583 -0.198614 -0.421948 -0.225165 0.224853 0.054949 0.190379 0.404999 -0.389018 -0.468676 0.012901 -0.355101 -0.429047 0.331614 -0.250515 -0.241778 0.064300 -0.321986 -0.353246 -0.217563 -0.210323 -0.111377 0.264559 0.246161 0.276478 0.244132 0.232666 0.234133 0.264500 0.281325 0.259648 0.261073 0.387269
chargesum: 0.00000
title: Mulliken charges with hydrogens summed into heavy atoms:
elementType: Cl O O O C C C C C C C C C C C C C C C C C C
charge: -0.041583 -0.198614 -0.034679 -0.225165 0.224853 0.054949 0.190379 0.404999 -0.124459 -0.222516 0.012901 -0.078623 -0.184915 0.331614 -0.017849 -0.007645 0.064300 -0.057486 -0.071921 0.042085 0.050751 -0.111377
polarizability: 3.59839392e+02 9.27212951e+00 1.98147986e+02 1.41696961e+01 3.89800727e+00 1.30209225e+02
1716.lowfreq: -5.5258 -2.0053 -0.0008 -0.0008 0.0012 3.5339 6.2221 34.6396 41.5201
frequency: 1.5374 34.6384 41.4664 59.1985 83.2456 94.0045 123.2008 151.8179 180.8570 198.5873 207.9784 232.6219 256.6585 297.2354 310.8954 349.0705 355.6385 384.4104 409.3360 426.5199 457.6179 481.0278 507.4514 513.8151 522.3426 572.5314 588.8613 605.6630 619.0377 624.1788 667.7903 680.3254 696.9056 716.8659 735.3849 747.1681 766.8064 805.9465 820.1008 834.4079 838.2073 847.0906 861.0770 891.6253 962.1879 964.6499 970.0305 984.5234 987.3428 989.7588 999.0200 1003.3335 1035.4999 1070.0121 1073.8289 1108.4352 1153.0748 1161.6512 1180.2995 1184.2785 1189.3395 1239.2288 1255.1004 1278.8603 1293.2423 1312.6616 1350.3291 1372.3190 1396.7188 1401.5622 1407.3039 1427.1636 1459.5030 1472.6052 1510.6747 1546.5658 1566.5814 1582.8930 1594.5759 1597.1504 1628.8237 1629.7665 3126.3061 3129.5809 3140.6989 3151.3752 3154.8020 3155.4719 3161.2861 3173.9338 3177.2222 3189.4859 3505.6946
redmass: 9.3261 7.3460 5.0097 6.1212 5.3036 9.3999 6.3233 12.1193 7.3057 4.4419 7.1769 6.9594 7.3796 7.4872 7.2344 6.2916 7.3714 4.7659 2.9275 3.9737 4.0673 3.2729 6.0814 3.3498 6.1867 3.5598 4.2212 2.8262 3.1018 4.2535 4.1975 5.1277 4.4187 6.3524 4.9080 2.7040 1.4978 4.1672 2.7730 1.7269 1.8318 1.7001 2.3273 1.7486 7.1736 1.3690 1.3623 1.4199 1.3957 5.0410 1.3815 3.5453 2.2753 2.9530 2.5351 1.3426 1.4611 1.9085 1.1273 1.2047 1.7290 1.9552 2.0682 2.6555 1.2785 2.0613 3.7401 5.3291 4.2500 4.8294 3.0000 3.5841 2.3517 2.4511 3.4609 10.8637 8.1701 7.7853 6.1468 6.6215 6.4344 8.8946 1.0870 1.0875 1.0908 1.0894 1.0889 1.0965 1.0979 1.0962 1.0975 1.0948 1.0638
irintensity: 1.2078 0.1442 0.5057 1.3419 0.0603 1.9197 1.1260 1.2569 0.3350 3.5920 2.2661 4.7085 1.0896 0.7147 1.6398 2.6348 6.6738 5.8113 0.6287 11.9189 10.5972 16.2844 20.4497 8.5989 7.0562 21.2794 30.8428 58.6168 31.6256 24.3642 13.9065 4.8833 12.7185 4.4397 8.6303 18.7261 59.5668 44.3237 51.6542 9.0998 23.5885 21.5710 39.7113 13.1013 91.2425 1.1314 1.0745 2.9465 5.1039 51.7969 0.8780 59.0399 13.6191 36.3527 220.9331 10.0865 23.0899 18.4758 25.0233 17.2260 27.8795 2.0049 170.0325 172.0437 8.6043 31.3762 23.4319 19.1633 9.8465 25.9642 11.0883 12.2616 39.3287 14.7756 11.8476 161.5657 18.9880 49.2960 60.7140 38.1133 0.4998 243.7935 0.3869 4.3672 16.2269 7.3904 0.0490 11.1022 30.3027 4.8654 2.1943 10.2037 44.1352
temp: 298.150 k
press: 1.00000 atm
elementType: 17 8 8 8 6 6 6 6 6 6 6 6 6 6 6 6 6 6 6 6 6 6 1 1 1 1 1 1 1 1 1 1 1
symmnumber: 1
zpe: 622105.4 jmol-1
zpe.correction: 0.236947 hartree
zpe.thermalcorrener: 0.255072 hartree
zpe.thermalcorrenthalpy: 0.256016 hartree
zpe.thermalcorrgfe: 0.186355 hartree
zpe.sumelectzpe: -1376.767219 hartree
zpe.sumelectthermal: -1376.749094 hartree
zpe.sumelectthermalent: -1376.748150 hartree
zpe.sumelectthermalfe: -1376.817811 hartree
dipole: -2.7570 -2.8457 -0.5897
dipole: 4.0059
quadrupole: -121.2095 -122.3404 -135.9503
quadrupole: 3.0328 9.6337 -4.7726
quadrupole: 5.2906 4.1596 -9.4502 3.0328 9.6337 -4.7726
hfenergy: -1377.004166 hartree
pointgroup: C01 [X(C18H11Cl1O3)]
dipole: 1.2249603 -0.9313657 0.3404346 debye
polarizability: 359.1175545|14.4802408|197.5098498|14.8679132|-8.8845877|131.5691989 unknown
InChI: InChI=1S/C18H11ClO3/c19-13-8-5-12(6-9-13)17(20)15-10-7-11-3-1-2-4-14(11)16(15)18(21)22/h1-10,21H
charge 0 multiplicity 1
33 atoms
Cl -6.352481 -1.75794 1.048439
O  -1.108188 1.615703 -1.765623
O  1.896339 3.181315 0.079701
O  -0.134727 2.530506 0.978442
C  2.604394 0.256981 0.18851
C  1.291941 0.825305 -0.026735
C  0.247264 0.035729 -0.553818
C  2.819577 -1.137767 -0.159488
C  0.481727 -1.336456 -0.884501
C  1.73893 -1.905951 -0.696892
C  -1.084893 0.638846 -0.959081
C  3.706783 0.986725 0.753456
C  4.106172 -1.734293 0.053291
C  -2.349716 0.012454 -0.459793
C  4.946152 0.375402 0.952291
C  5.154563 -0.995002 0.599443
C  0.930062 2.218013 0.396349
C  -2.36979 -0.868117 0.654455
C  -3.573035 0.353384 -1.098098
C  -3.586463 -1.407287 1.122383
C  -4.794055 -0.182716 -0.648862
C  -4.77919 -1.059321 0.457356
H  -0.334989 -1.927877 -1.3110
H  1.91434 -2.955071 -0.961943
H  3.573708 2.040537 1.005209
H  4.248535 -2.786759 -0.218601
H  5.772438 0.953847 1.379535
H  6.134561 -1.456554 0.760869
H  -1.438544 -1.115622 1.173841
H  -3.543166 1.048635 -1.943325
H  -3.609949 -2.077144 1.986386
H  -5.737376 0.072537 -1.1396
H  1.549078 4.074155 0.353709
