program: Gaussian 09
title: 000246616
version: EM64L-G09RevD.01
frameworkgroup: C1[X(C17H16O3)]
method: RPBEPBE
basis: SDD
operation: Freq
keyword: #pfreq=noraman
keyword: PBEPBE/SDD
title: #p freq=noraman PBEPBE/SDD
converged: YES YES NO NO
title: Mulliken charges:
elementType: O O O C C C C C C C C C C C C C C C C C H H H H H H H H H H H H H H H H
charge: -0.206454 -0.286110 -0.231813 0.385433 0.338911 0.321361 -0.557101 0.251806 -0.023406 -0.384351 -0.416983 0.098025 -0.819763 -0.809194 -0.364382 -0.343393 -0.228813 -0.224237 0.136453 -0.501463 0.250355 0.273855 0.233212 0.233277 0.225397 0.226550 0.227666 0.227461 0.232552 0.263722 0.276629 0.236711 0.235220 0.244749 0.245601 0.232520
chargesum: 0.00000
title: Mulliken charges with hydrogens summed into heavy atoms:
elementType: O O O C C C C C C C C C C C C C C C C C
charge: -0.206454 -0.286110 -0.231813 0.385433 0.338911 0.321361 -0.306747 0.251806 -0.023406 -0.110497 -0.183771 0.098025 -0.134540 -0.121515 -0.100660 -0.066764 0.007898 0.010983 0.136453 0.221406
polarizability: 2.40980802e+02 -1.99408793e+01 1.80707324e+02 2.24464359e+01 9.66839576e+00 1.68667983e+02
1716.lowfreq: -7.9571 -0.0009 -0.0007 0.0002 4.0509 7.1180 14.5982 31.8295 50.3629
frequency: 14.4896 31.7570 50.3613 70.2877 86.7732 96.4247 107.8790 110.6609 120.9189 153.0701 158.0107 182.3147 206.0413 216.5855 257.9101 287.0667 292.8936 304.0276 331.0892 364.7288 382.6258 420.8404 438.2683 441.9729 489.7833 528.1018 534.6031 575.1599 621.2064 648.7960 676.6771 690.4085 702.6852 737.3160 740.4950 771.3658 781.0292 788.0230 851.6307 859.8181 895.8775 909.2719 922.2546 949.6221 973.8911 984.9007 994.0708 1002.9198 1004.4429 1031.2157 1040.5226 1050.1396 1054.6107 1115.0609 1116.0747 1123.6511 1148.7496 1154.1035 1177.2130 1188.7715 1233.7881 1248.1205 1267.1413 1280.5879 1302.2523 1375.5126 1376.7576 1393.8061 1397.9830 1407.7433 1422.1319 1428.1706 1451.4820 1462.6582 1464.5734 1467.9857 1472.1583 1475.4713 1478.7101 1497.5303 1546.0204 1573.1969 1585.3945 1600.2814 1618.2568 1620.4407 2969.1532 2970.8748 3004.7437 3039.6031 3043.7625 3084.2716 3088.2580 3106.3547 3125.1253 3127.4253 3134.9603 3149.0265 3149.8080 3162.9615 3163.8417 3179.0746
redmass: 5.1595 3.6689 4.8916 3.7702 3.3395 1.4802 2.6915 1.6376 2.0663 3.7115 1.1374 3.8382 4.1701 3.5471 5.4111 3.7318 3.0451 4.0007 7.4494 5.8213 4.4098 3.6484 2.7664 4.0065 5.6106 4.3599 3.9840 4.0977 6.1371 6.3150 5.1315 5.0112 3.9137 3.0475 3.9178 5.2593 2.6106 1.9866 1.6495 3.6390 1.4507 1.4094 7.5178 2.9603 1.4048 1.3738 1.6195 1.3460 1.6295 1.4634 3.0564 3.5894 1.6554 1.3757 1.9890 1.7940 1.4672 1.7159 1.0635 2.2709 2.2639 3.5894 1.8908 1.5187 2.2884 5.6843 10.1448 1.2820 2.5898 1.3718 1.4164 1.6779 1.0495 1.0468 1.0518 1.1888 2.4555 1.0675 1.1635 2.4237 9.7722 7.0291 7.5262 6.4709 6.4086 9.2008 1.0376 1.0384 1.0295 1.0967 1.0966 1.0983 1.0978 1.1045 1.0896 1.0904 1.0860 1.1046 1.0912 1.0952 1.0967 1.0975
irintensity: 0.5877 0.1487 2.2880 0.5047 3.2684 0.1103 1.2076 0.1789 0.5932 1.4940 1.9868 1.9630 4.0508 0.6955 3.1113 20.6180 6.0432 2.1088 11.1566 1.0350 2.0551 1.6237 4.4888 1.6238 5.3996 2.0159 0.6008 3.3457 13.8768 4.0499 6.7715 26.4433 27.6463 30.9174 5.9348 11.2884 31.9603 24.2056 20.0811 20.8447 0.2075 4.4963 4.7844 40.4976 1.2290 2.0522 0.5118 1.0742 6.7810 11.5968 44.0490 113.0134 0.0335 5.5186 30.6355 44.5947 48.9137 12.8970 0.8313 1.8809 72.5221 181.6193 74.8683 55.9869 149.1298 4.3612 8.6763 3.6378 5.8521 12.1472 27.3995 3.3367 14.1557 1.3415 9.5822 28.9804 6.2372 24.8471 5.7984 0.8625 203.3248 20.2919 15.6212 26.5606 60.2757 118.3294 58.5704 9.5409 35.3490 39.0915 0.4587 27.9675 11.6628 23.3401 30.2473 0.4516 1.7818 14.0679 12.6911 8.5764 14.6541 11.9844
temp: 298.150 k
press: 1.00000 atm
elementType: 8 8 8 6 6 6 6 6 6 6 6 6 6 6 6 6 6 6 6 6 1 1 1 1 1 1 1 1 1 1 1 1 1 1 1 1
symmnumber: 1
zpe: 741139.6 jmol-1
zpe.correction: 0.282285 hartree
zpe.thermalcorrener: 0.301613 hartree
zpe.thermalcorrenthalpy: 0.302558 hartree
zpe.thermalcorrgfe: 0.232875 hartree
zpe.sumelectzpe: -881.667932 hartree
zpe.sumelectthermal: -881.648603 hartree
zpe.sumelectthermalent: -881.647659 hartree
zpe.sumelectthermalfe: -881.717342 hartree
dipole: -0.5276 2.5624 4.5096
dipole: 5.2136
quadrupole: -96.7797 -106.1524 -121.1203
quadrupole: -0.4963 5.0318 -6.7488
quadrupole: 11.2378 1.8651 -13.1029 -0.4963 5.0318 -6.7488
hfenergy: -881.9502167 hartree
pointgroup: C01 [X(C17H16O3)]
dipole: -0.1783954 0.3738141 2.008916 debye
polarizability: 236.1420403|-31.5390038|178.0980906|15.4255158|10.0386506|176.1159783 unknown
InChI: InChI=1S/C17H16O3/c1-11-8-9-13(10-12(11)2)16(18)14-6-4-5-7-15(14)17(19)20-3/h4-10H,1-3H3
charge 0 multiplicity 1
36 atoms
O  0.297526 -1.163877 -2.653734
O  2.183229 2.276838 0.912324
O  0.844617 1.803864 -0.932263
C  -1.132079 -0.470511 -0.832898
C  -2.614819 -0.110263 1.113781
C  -3.684725 0.23314 0.229807
C  -1.356808 -0.453576 0.568175
C  1.384535 -1.060771 -0.514277
C  0.181429 -0.868298 -1.426412
C  -2.200844 -0.138107 -1.703521
C  -3.454121 0.211326 -1.170962
C  2.036971 -0.009147 0.194981
C  -2.821887 -0.109107 2.617905
C  -5.048359 0.613247 0.774566
C  1.884044 -2.380487 -0.390919
C  3.145764 -0.30106 1.032418
C  2.985459 -2.665353 0.445003
C  3.613875 -1.623283 1.166246
C  1.609801 1.404249 -0.021108
C  1.834881 3.705835 0.733442
H  -0.541952 -0.725947 1.249461
H  -2.02107 -0.155854 -2.783092
H  -4.275663 0.476375 -1.847125
H  -1.897757 -0.393878 3.148696
H  -3.128824 0.888888 2.986271
H  -3.617243 -0.817096 2.921376
H  -5.484025 -0.202268 1.383882
H  -4.988844 1.501332 1.433243
H  -5.755612 0.842606 -0.039969
H  1.399995 -3.181524 -0.958893
H  3.635729 0.523157 1.557551
H  3.352708 -3.693917 0.52974
H  4.470408 -1.83837 1.813871
H  0.743881 3.844728 0.816086
H  2.16852 4.059718 -0.256577
H  2.365359 4.22719 1.542426
