program: Gaussian 09
title: 000246612
version: EM64L-G09RevD.01
frameworkgroup: C1[X(C17H11ClO)]
method: RPBEPBE
basis: SDD
operation: Freq
keyword: #p
keyword: freq=noraman
keyword: PBEPBE/SDD
title: #p freq=noraman PBEPBE/SDD
converged: YES YES NO NO
title: Mulliken charges:
elementType: Cl O C C C C C C C C C C C C C C C C C H H H H H H H H H H H
charge: -0.056989 -0.204260 0.189666 0.242010 0.384611 -0.037740 -0.391728 -0.365360 -0.446585 0.313909 -0.437493 -0.242802 -0.250358 -0.244946 -0.308828 -0.374566 -0.104465 -0.212690 -0.232904 0.267501 0.256139 0.243697 0.240776 0.235641 0.232425 0.232718 0.291320 0.280832 0.239491 0.260978
chargesum: 0.00000
title: Mulliken charges with hydrogens summed into heavy atoms:
elementType: Cl O C C C C C C C C C C C C C C C C C
charge: -0.056989 -0.204260 0.189666 0.242010 0.384611 -0.037740 -0.124226 -0.109221 -0.202888 0.313909 -0.196718 -0.007161 -0.017933 -0.012228 -0.017508 -0.093735 -0.104465 0.026801 0.028074
polarizability: 2.34189258e+02 -8.24332351e+00 2.11385463e+02 3.52144181e+01 1.04752207e+01 1.46612402e+02
1716.lowfreq: -8.3838 -0.0014 -0.0012 0.0006 3.2332 14.2420 30.8969 38.3203 45.4811
frequency: 30.8409 38.2148 45.3910 104.3171 125.6326 168.5110 191.3852 192.7715 203.0024 267.3815 301.3187 332.0815 369.7984 392.3305 417.2395 429.2194 469.3144 472.3984 488.5444 512.8851 523.6553 582.4018 629.3040 644.9283 659.3518 678.8648 725.1972 745.1118 755.1210 786.1284 788.8788 807.3714 821.3339 826.8797 880.5312 904.2138 916.7393 929.7617 935.6109 965.8096 984.2218 989.5301 993.3785 995.9733 1018.3292 1037.4939 1071.7145 1079.4746 1097.8518 1148.9555 1165.4288 1175.2698 1179.8032 1206.5550 1236.7280 1257.4309 1280.5163 1300.4317 1368.1803 1379.6079 1401.2334 1407.6935 1412.3775 1438.7237 1451.8781 1459.2421 1515.6469 1535.6128 1571.4754 1584.5132 1592.0584 1600.9896 1629.5439 3123.9248 3127.0584 3137.6402 3145.0030 3147.0497 3155.2382 3165.0485 3165.7836 3169.1781 3169.9225 3176.8313
redmass: 6.5711 6.2367 6.5673 5.9159 7.2141 4.5405 5.3168 4.6839 4.7397 5.5395 5.8515 7.8392 7.0157 4.8120 4.2709 3.2488 3.6175 4.7152 3.9985 6.5026 6.6115 4.1260 4.9079 5.1846 6.2026 2.7977 2.9235 1.9006 2.6972 2.0170 4.0398 1.7091 2.1730 2.6920 1.7700 1.5192 3.5313 1.3953 1.5547 1.4034 5.6683 1.3746 1.3696 1.3634 3.9468 2.5486 2.1810 2.0514 1.6508 1.5512 1.4316 1.0886 1.1292 1.6858 1.8956 1.8441 1.5022 1.9460 2.6390 9.5923 2.5802 2.8916 6.2817 2.4925 2.3535 2.4373 3.7873 9.9420 6.7463 7.4008 5.4056 6.8854 6.4643 1.0873 1.0873 1.0888 1.0874 1.0913 1.0945 1.0928 1.0986 1.0980 1.0942 1.0989
irintensity: 0.1441 3.0634 0.5916 3.3817 0.7771 1.6530 1.8675 1.0425 2.3327 0.1951 0.8685 6.0264 1.2734 1.7404 7.0168 2.4331 0.5577 0.1741 23.4704 2.0918 2.7360 8.3812 8.0770 4.5040 6.6382 13.2616 41.0493 22.1906 14.5970 84.2474 11.3188 27.6679 25.5481 24.6077 5.7339 17.4596 22.7208 0.9133 9.2169 4.5001 4.1054 1.4130 1.6704 1.1292 9.7874 14.7772 22.5624 2.1482 5.2896 9.8668 19.4324 6.7529 3.3424 39.6338 5.1579 158.6872 23.8562 121.5634 5.6168 2.5996 4.3990 14.9854 2.1165 1.2161 7.4925 13.8572 17.3881 193.4975 12.8412 14.3334 2.5046 7.4815 0.6122 0.9809 4.4746 7.0306 6.9012 10.7070 28.9981 2.3109 24.0030 12.2010 3.8464 10.6466
temp: 298.150 k
press: 1.00000 atm
elementType: 17 8 6 6 6 6 6 6 6 6 6 6 6 6 6 6 6 6 6 1 1 1 1 1 1 1 1 1 1 1
symmnumber: 1
zpe: 588026.3 jmol-1
zpe.correction: 0.223967 hartree
zpe.thermalcorrener: 0.238951 hartree
zpe.thermalcorrenthalpy: 0.239896 hartree
zpe.thermalcorrgfe: 0.180360 hartree
zpe.sumelectzpe: -1188.420831 hartree
zpe.sumelectthermal: -1188.405847 hartree
zpe.sumelectthermalent: -1188.404903 hartree
zpe.sumelectthermalfe: -1188.464438 hartree
dipole: 0.4675 -1.9347 -0.3012
dipole: 2.0130
quadrupole: -98.3158 -123.1838 -113.0199
quadrupole: -7.3487 11.9022 7.3436
quadrupole: 13.1907 -11.6773 -1.5134 -7.3487 11.9022 7.3436
hfenergy: -1188.6447987 hartree
pointgroup: C01 [X(C17H11Cl1O1)]
dipole: -0.3467667 -0.7044148 -0.1039006 debye
polarizability: 231.6460288|-6.6279397|213.8518138|37.8184939|0.5160815|146.6892803 unknown
InChI: InChI=1S/C17H11ClO/c18-14-8-3-7-13(11-14)17(19)16-10-4-6-12-5-1-2-9-15(12)16/h1-11H
charge 0 multiplicity 1
30 atoms
Cl 2.835997 -2.432422 -2.193804
O  0.907883 2.597961 1.302612
C  -1.466324 0.111814 0.140159
C  -0.685482 1.32634 0.024677
C  -2.743687 0.043945 -0.54843
C  0.667332 1.529436 0.659453
C  -1.200468 2.423025 -0.687435
C  -1.075611 -1.008851 0.949908
C  -3.203085 1.170493 -1.306428
C  1.769241 0.519854 0.462852
C  -3.54169 -1.143702 -0.442039
C  -2.45172 2.345645 -1.364251
C  -1.8798 -2.147167 1.042068
C  -3.119107 -2.224138 0.332541
C  1.75184 -0.39905 -0.620459
C  2.884285 0.551686 1.342362
C  2.847052 -1.262134 -0.792998
C  3.962716 -0.335262 1.153779
C  3.955527 -1.254713 0.076738
H  -0.612008 3.345448 -0.725865
H  -0.140889 -0.966627 1.516348
H  -4.164518 1.09853 -1.828916
H  -4.499809 -1.181923 -0.973999
H  -2.813474 3.209477 -1.931319
H  -1.561798 -2.988506 1.667279
H  -3.735727 -3.125912 0.410649
H  0.908845 -0.427261 -1.316144
H  2.884457 1.285057 2.1547
H  4.81829 -0.316328 1.836751
H  4.79093 -1.942613 -0.083488
