program: Gaussian 09
title: 000246618
version: EM64L-G09RevD.01
frameworkgroup: C1[X(C17H16O3)]
method: RPBEPBE
basis: SDD
operation: Freq
keyword: #pfreq=noraman
keyword: PBEPBE/SDD
title: #p freq=noraman PBEPBE/SDD
converged: YES YES NO NO
title: Mulliken charges:
elementType: O O O C C C C C C C C C C C C C C C C C H H H H H H H H H H H H H H H H
charge: -0.294276 -0.205971 -0.241312 0.256461 0.082349 0.045363 -0.007858 0.155048 0.345346 -0.369227 -0.345161 -0.684704 -0.687997 -0.225967 -0.223469 -0.365563 -0.350715 -0.234942 -0.233778 -0.234959 0.236474 0.265630 0.275705 0.213515 0.260697 0.217526 0.211759 0.232784 0.221921 0.237295 0.235586 0.248558 0.273285 0.228967 0.231113 0.230514
chargesum: 0.00000
title: Mulliken charges with hydrogens summed into heavy atoms:
elementType: O O O C C C C C C C C C C C C C C C C C
charge: -0.294276 -0.205971 -0.241312 0.256461 0.082349 0.281838 -0.007858 0.155048 0.345346 -0.103597 -0.069456 0.007034 -0.021532 0.011329 0.012117 -0.117005 -0.077429 -0.005975 -0.002665 -0.004444
polarizability: 2.02763259e+02 2.15986084e+01 2.26170035e+02 2.08269591e+01 1.33207973e+00 1.48596795e+02
1716.lowfreq: -7.8229 -2.4877 -0.0008 -0.0005 -0.0004 8.3071 12.2802 37.8134 45.5007
frequency: 11.9666 37.7643 45.4179 55.3651 70.0134 86.7739 99.6264 116.6855 155.8788 175.7031 196.0814 220.9019 228.0102 255.7994 271.2825 291.3864 336.5845 367.4713 399.0383 402.8191 424.5567 431.7499 443.4369 455.0399 515.3308 572.4279 613.6092 632.5996 654.4351 676.2223 688.5984 700.4595 712.8292 769.5631 779.9079 789.0541 798.9054 817.3219 859.6830 892.5783 902.6450 919.6917 927.9733 942.8287 943.7165 973.6618 988.5424 989.8165 1002.5949 1004.7848 1024.8654 1035.4677 1045.6094 1083.3215 1099.6252 1121.1327 1152.6169 1157.1672 1172.9029 1176.7184 1182.1719 1186.8702 1240.7361 1259.6372 1285.0763 1317.0969 1328.4556 1337.5109 1377.0694 1381.9114 1387.5113 1397.9193 1425.8538 1435.0546 1457.7144 1465.4746 1470.0927 1473.0916 1478.7770 1488.2123 1551.4782 1572.4293 1591.8936 1595.8838 1608.0036 1609.9628 2989.0309 2992.6587 3029.2628 3084.1907 3093.0824 3098.0794 3104.3570 3125.4321 3134.7887 3135.5572 3146.3002 3150.4514 3158.0421 3164.5853 3168.6649 3179.6538
redmass: 5.3856 3.6932 3.0156 4.4953 4.4209 5.7856 5.8178 5.1613 4.7162 4.8796 1.0415 3.7489 2.0383 1.7593 6.0351 3.7966 7.7668 3.9639 2.9790 2.8980 3.6828 4.8634 3.8281 3.4496 4.1843 4.6119 6.4489 6.1766 6.5455 5.3650 3.9202 1.6398 5.2500 2.1798 3.7428 2.2073 2.4691 5.5554 1.2483 1.5968 2.5372 4.4794 1.2228 1.3624 1.4664 1.4029 1.9057 2.7863 1.3449 1.3359 2.2345 5.0685 2.5732 1.5707 1.7842 2.1395 2.3310 2.0546 1.0612 1.0686 1.9190 1.1501 3.2966 1.9492 2.1776 1.3490 1.5478 1.3091 10.3791 1.2559 9.2288 1.2305 2.1761 2.2762 1.0529 1.0473 2.3748 1.0812 2.3179 1.0504 10.1892 7.2256 6.4915 7.8384 7.6656 6.4413 1.0356 1.0359 1.0866 1.0994 1.0987 1.1006 1.1007 1.0848 1.0882 1.0861 1.0929 1.0910 1.0963 1.0967 1.1004 1.0972
irintensity: 0.4879 0.0492 0.3698 3.7068 0.4991 1.7610 0.7462 0.2385 0.8342 4.4073 0.0374 3.2748 3.1512 4.4059 3.4064 0.5631 10.7109 4.0250 4.2699 0.9914 2.8556 3.6509 4.8553 0.3388 2.3503 1.8882 0.2266 25.8248 7.3527 9.5523 21.3627 111.7172 10.3065 31.3222 9.2104 20.3092 16.3410 14.9255 0.9616 5.7986 15.0027 44.3527 2.9168 0.2478 2.6239 2.1282 1.7540 0.4299 1.0710 0.4755 2.5669 169.3439 90.7722 14.2157 120.4733 27.4766 11.9131 10.2565 0.2198 4.4769 37.2969 12.2008 273.3856 115.9749 129.6951 10.5078 9.3371 1.8030 7.4961 30.9935 2.2355 17.6495 2.9421 20.5254 6.0280 6.2842 4.3858 7.3561 0.8313 18.6056 148.7614 35.7810 18.0493 76.7134 54.2036 29.5800 13.3970 24.7996 5.1362 4.5142 51.4092 21.3615 26.8008 0.3935 5.1827 1.7007 23.9909 9.5109 17.2091 17.2525 21.4208 11.7067
temp: 298.150 k
press: 1.00000 atm
elementType: 8 8 8 6 6 6 6 6 6 6 6 6 6 6 6 6 6 6 6 6 1 1 1 1 1 1 1 1 1 1 1 1 1 1 1 1
symmnumber: 1
zpe: 743949.2 jmol-1
zpe.correction: 0.283355 hartree
zpe.thermalcorrener: 0.301957 hartree
zpe.thermalcorrenthalpy: 0.302901 hartree
zpe.thermalcorrgfe: 0.234399 hartree
zpe.sumelectzpe: -881.667900 hartree
zpe.sumelectthermal: -881.649298 hartree
zpe.sumelectthermalent: -881.648354 hartree
zpe.sumelectthermalfe: -881.716856 hartree
dipole: 2.6068 -1.3773 3.8790
dipole: 4.8723
quadrupole: -105.9943 -99.9710 -121.1074
quadrupole: 4.3338 -3.6892 5.8801
quadrupole: 3.0299 9.0532 -12.0831 4.3338 -3.6892 5.8801
hfenergy: -881.9512551 hartree
pointgroup: C01 [X(C17H16O3)]
dipole: -0.6697548 -0.7705312 -1.6224023 debye
polarizability: 214.7025384|-25.7521831|210.0883553|24.3487376|6.1348904|152.7391954 unknown
InChI: InChI=1S/C17H16O3/c1-12(2)20-17(19)15-11-7-6-10-14(15)16(18)13-8-4-3-5-9-13/h3-12H,1-2H3
charge 0 multiplicity 1
36 atoms
O  -2.048525 -1.498141 -0.327349
O  1.248222 1.94088 2.069464
O  -0.334668 -1.048798 1.192993
C  -0.292784 1.721871 0.238259
C  -1.286947 0.766771 -0.127922
C  -2.006812 -2.958353 0.060646
C  1.000033 1.380595 0.960612
C  -1.147837 -0.652685 0.319015
C  2.011377 0.501969 0.285977
C  -0.506812 3.08694 -0.073145
C  -2.44749 1.187161 -0.828114
C  -0.894664 -3.64714 -0.742703
C  -3.411249 -3.491569 -0.228065
C  -1.664151 3.499557 -0.76852
C  -2.633436 2.54527 -1.156346
C  1.937187 0.189429 -1.096842
C  3.098267 0.008705 1.055681
C  2.934269 -0.608767 -1.699061
C  4.087302 -0.794105 0.455879
C  4.008158 -1.10541 -0.924321
H  -1.772006 -2.995734 1.140723
H  0.244317 3.820604 0.236704
H  -3.198758 0.437972 -1.091763
H  -0.855204 -4.720755 -0.481989
H  0.088051 -3.201935 -0.51417
H  -1.087576 -3.559443 -1.826685
H  -3.469443 -4.560401 0.046494
H  -4.169755 -2.941037 0.354231
H  -3.653667 -3.394881 -1.301112
H  -1.808839 4.559527 -1.003916
H  -3.533355 2.86046 -1.695024
H  1.113184 0.581131 -1.703623
H  3.138515 0.265451 2.119204
H  2.877249 -0.84008 -2.768524
H  4.918234 -1.180036 1.056612
H  4.780013 -1.727524 -1.391699
