program: Gaussian 09
title: 000246600
version: EM64L-G09RevD.01
frameworkgroup: C1[X(C14H11ClO)]
method: RPBEPBE
basis: SDD
operation: Freq
keyword: #p
keyword: freq=noraman
keyword: PBEPBE/SDD
title: #p freq=noraman PBEPBE/SDD
converged: YES YES NO NO
title: Mulliken charges:
elementType: Cl O C C C C C C C C C C C C C C H H H H H H H H H H H
charge: -0.059814 -0.214532 -0.680761 0.498694 0.129260 0.332939 -0.382633 -0.435124 -0.292751 -0.367350 -0.217343 -0.224512 -0.120082 -0.210206 -0.244295 -0.233066 0.263293 0.227619 0.256440 0.231188 0.270099 0.283165 0.228315 0.228922 0.239989 0.230961 0.261588
chargesum: 0.00000
title: Mulliken charges with hydrogens summed into heavy atoms:
elementType: Cl O C C C C C C C C C C C C C C
charge: -0.059814 -0.214532 -0.189849 0.498694 0.129260 0.332939 -0.126192 -0.203936 -0.022652 -0.084185 0.010971 0.004409 -0.120082 0.029783 -0.013334 0.028522
polarizability: 1.71219096e+02 -1.38352726e+00 1.84842267e+02 -4.11721749e-01 1.10966292e+01 1.10217984e+02
1716.lowfreq: -0.0027 -0.0021 0.0009 2.1944 5.0002 9.4118 18.0255 28.5719 44.1150
frequency: 17.3875 28.5685 44.0672 92.7037 131.7975 137.5640 192.9537 209.4094 294.5331 302.8275 360.8905 383.2929 403.8102 418.4515 454.2332 471.0348 475.7316 541.6633 591.6050 618.2435 656.3996 675.6479 704.4770 717.2530 748.9022 789.9946 799.9996 829.2854 855.7264 883.4344 919.0314 933.2374 940.5082 979.3630 984.7143 989.5556 997.7684 1001.9412 1026.9305 1035.3964 1073.4864 1083.5564 1099.8775 1151.7003 1173.4590 1174.9030 1190.1881 1199.4990 1261.7628 1278.9099 1297.0926 1331.6273 1381.4137 1382.4907 1409.9631 1440.9187 1456.7169 1467.5214 1482.8607 1558.7964 1584.6869 1593.6372 1605.0961 1613.3094 3007.0434 3067.6341 3110.7000 3124.2714 3135.9662 3145.5415 3146.7864 3164.8916 3165.2884 3176.2558 3183.6962
redmass: 5.8475 5.7777 4.4975 7.6431 6.4079 5.1476 4.7859 5.2366 5.2097 4.8645 4.4864 5.6308 2.8280 3.1739 4.4461 3.1082 5.0638 4.7005 4.6626 6.0620 6.4067 2.8697 2.2543 2.1912 2.3037 3.7490 1.7827 2.3155 1.2516 1.6566 1.5001 1.6833 1.7134 1.4154 5.5019 6.1294 1.3249 1.3590 2.2477 3.0595 1.9780 1.6004 1.6528 1.3338 1.0547 1.0856 1.1496 2.6246 2.1672 1.4138 1.4874 1.2882 8.2676 9.8783 2.9144 2.1573 1.5599 1.5290 2.1103 7.3588 7.4555 6.0704 6.9117 6.4539 1.0588 1.1026 1.0884 1.0863 1.0910 1.0874 1.0959 1.1014 1.0927 1.0985 1.0924
irintensity: 0.0862 1.8653 0.0802 2.7547 1.8618 0.0783 0.1795 4.4827 0.1933 5.0351 3.2257 1.6936 0.0220 2.3414 3.9084 6.1319 3.7864 4.2298 39.0611 4.4838 13.1730 19.4929 31.9782 72.0595 23.5933 28.6927 44.8525 0.6821 0.3804 12.6982 3.9609 3.7510 8.4210 0.1096 5.6626 1.2351 0.1532 1.9157 7.4866 32.6184 14.9810 8.7089 4.5186 61.7640 1.2205 2.6258 2.8641 2.5083 177.3185 14.5193 49.6182 9.2165 0.4960 1.6658 19.0098 7.7916 12.8973 21.1656 19.7800 160.8089 22.2676 1.2922 18.4643 9.9948 14.7742 9.4001 12.4437 0.8103 8.9669 6.1057 29.0342 23.4262 0.7450 10.6951 0.6703
temp: 298.150 k
press: 1.00000 atm
elementType: 17 8 6 6 6 6 6 6 6 6 6 6 6 6 6 6 1 1 1 1 1 1 1 1 1 1 1
symmnumber: 1
zpe: 540484.1 jmol-1
zpe.correction: 0.205860 hartree
zpe.thermalcorrener: 0.219506 hartree
zpe.thermalcorrenthalpy: 0.220450 hartree
zpe.thermalcorrgfe: 0.162676 hartree
zpe.sumelectzpe: -1074.261120 hartree
zpe.sumelectthermal: -1074.247473 hartree
zpe.sumelectthermalent: -1074.246529 hartree
zpe.sumelectthermalfe: -1074.304303 hartree
dipole: -0.4649 -1.1547 0.2871
dipole: 1.2774
quadrupole: -91.4077 -106.9337 -95.2896
quadrupole: -8.8364 -1.5869 3.1641
quadrupole: 6.4693 -9.0567 2.5874 -8.8364 -1.5869 3.1641
hfenergy: -1074.4669792 hartree
pointgroup: C01[X(C14H11Cl1O1)]
dipole: -0.1322277 0.3139579 0.3694951 debye
polarizability: 170.6320811|10.4656758|120.5196923|0.0766982|26.0003975|175.1275729 unknown
InChI: InChI=1S/C14H11ClO/c15-13-8-4-7-12(10-13)14(16)9-11-5-2-1-3-6-11/h1-8,10H,9H2
charge 0 multiplicity 1
27 atoms
Cl -2.324329 0.627922 3.13252
O  -0.016374 -2.102781 -2.268319
C  1.292966 -1.931092 -0.231137
C  2.105774 -0.640832 -0.083879
C  0.015199 -1.727148 -1.059505
C  -1.18583 -1.066057 -0.43778
C  2.457377 0.115919 -1.23163
C  2.538322 -0.193863 1.189569
C  -1.177064 -0.585706 0.898988
C  -2.363522 -0.931567 -1.222312
C  3.224191 1.294974 -1.10562
C  3.308534 0.984559 1.316804
C  -2.34033 0.009685 1.415121
C  -3.516178 -0.331286 -0.680081
C  3.652192 1.734602 0.169058
C  -3.516573 0.147686 0.652629
H  1.887827 -2.689274 -0.771628
H  1.050928 -2.339992 0.766741
H  2.130832 -0.222988 -2.222079
H  2.284048 -0.774418 2.085918
H  -0.281469 -0.655477 1.520126
H  -2.344225 -1.307547 -2.249942
H  3.488459 1.869658 -2.000465
H  3.63856 1.315093 2.308046
H  -4.423024 -0.230872 -1.285283
H  4.24719 2.649376 0.26637
H  -4.40608 0.615628 1.08457
