program: Gaussian 09
title: 000246595
version: EM64L-G09RevD.01
frameworkgroup: C1[X(C13H12O3)]
method: RPBEPBE
basis: SDD
operation: Freq
keyword: #pfreq=noraman
keyword: PBEPBE/SDD
title: #p freq=noraman PBEPBE/SDD
converged: YES YES NO NO
title: Mulliken charges:
elementType: O O O C C C C C C C C C C C C C H H H H H H H H H H H H
charge: -0.217263 -0.268267 -0.257281 -0.578494 -0.591113 0.394415 0.135446 0.415209 -0.089080 -0.411263 -0.347384 -0.435851 -0.218750 -0.245200 0.208118 -0.503448 0.241312 0.235903 0.232193 0.293855 0.240684 0.281257 0.295760 0.232780 0.237195 0.236192 0.242079 0.240997
chargesum: 0.00000
title: Mulliken charges with hydrogens summed into heavy atoms:
elementType: O O O C C C C C C C C C C C C C
charge: -0.217263 -0.268267 -0.257281 -0.101279 -0.065066 0.394415 0.135446 0.415209 -0.089080 -0.170579 -0.066128 -0.140091 0.014030 -0.008005 0.208118 0.215821
polarizability: 2.57248245e+02 -8.22947144e+00 1.47176831e+02 3.13446690e+00 9.57223004e-01 7.36359539e+01
1716.lowfreq: -6.5330 0.0002 0.0004 0.0007 2.9381 6.0629 27.9385 50.6823 88.2533
frequency: 27.9184 50.6808 88.2511 95.9574 112.6910 118.0459 159.3256 207.7623 231.0756 249.9367 258.9210 299.4560 340.4493 378.8845 435.5524 440.1080 478.5788 488.7517 539.2477 595.2159 621.1586 675.8521 689.1271 708.1442 718.8896 748.4006 792.0581 803.1688 840.0633 885.6126 891.2663 925.3177 946.3827 977.1075 986.5151 1005.4761 1014.5672 1029.1990 1038.0007 1095.5051 1111.5010 1116.1167 1145.1947 1149.1123 1166.9861 1174.5151 1208.1725 1235.6625 1251.0213 1286.2866 1312.2628 1334.0604 1372.4434 1387.8476 1421.6936 1442.6646 1451.6830 1457.5626 1461.4438 1467.9720 1477.7897 1538.7424 1580.8681 1604.9362 1612.4969 1648.8471 2966.5657 2977.1679 3002.4992 3045.5000 3088.5917 3102.2018 3123.7320 3139.3290 3147.5241 3149.9744 3152.0960 3167.8321
redmass: 5.2644 5.8130 3.7391 1.8803 1.6501 4.5374 3.3124 3.7603 5.5593 5.6002 2.9565 5.0045 6.9423 3.1397 4.1055 3.7104 4.7294 3.7957 5.2690 6.5797 3.2602 5.8678 3.4639 5.2864 4.2668 1.7483 3.1218 2.2438 4.7617 2.8026 1.3544 5.1672 1.5370 1.4274 3.0044 1.3525 3.3361 2.2808 2.1720 2.2193 1.2695 2.4416 1.9577 1.4512 1.3282 1.0883 2.1498 1.6576 2.0729 1.4404 1.6969 1.6548 1.8249 6.3028 1.1947 2.4318 1.0497 1.2324 1.0518 1.1188 1.9511 10.8128 6.8634 8.5278 6.6293 8.5853 1.0692 1.0640 1.0298 1.0963 1.0925 1.1042 1.0869 1.0896 1.0898 1.1044 1.0938 1.1002
irintensity: 2.2725 1.3568 1.5984 0.6541 0.0102 2.1848 1.3909 2.5090 2.6688 8.3576 7.5552 24.6413 4.6191 4.4171 2.8054 2.6212 1.4398 5.2593 3.9477 22.3324 1.8478 3.9917 1.0755 6.0922 16.3864 64.0426 5.2383 12.6983 6.6176 24.3220 0.0461 54.4696 26.1266 4.7993 4.1640 0.5734 6.4468 29.3932 1.0252 6.2756 0.1247 163.2101 242.7221 20.4086 55.5918 0.5300 1.6666 11.3894 173.8666 169.1696 75.4825 1.3674 39.9769 6.3095 25.9942 27.4501 14.7794 14.0648 12.7038 23.2107 4.9754 148.4883 27.2044 119.5840 27.1275 28.6409 4.8417 25.7552 38.0035 23.1790 3.8323 27.2450 3.7879 12.4248 0.9619 19.2576 10.9515 31.6223
temp: 298.150 k
press: 1.00000 atm
elementType: 8 8 8 6 6 6 6 6 6 6 6 6 6 6 6 6 1 1 1 1 1 1 1 1 1 1 1 1
symmnumber: 1
zpe: 571034.5 jmol-1
zpe.correction: 0.217496 hartree
zpe.thermalcorrener: 0.231757 hartree
zpe.thermalcorrenthalpy: 0.232701 hartree
zpe.thermalcorrgfe: 0.175215 hartree
zpe.sumelectzpe: -727.108966 hartree
zpe.sumelectthermal: -727.094705 hartree
zpe.sumelectthermalent: -727.093761 hartree
zpe.sumelectthermalfe: -727.151247 hartree
dipole: 1.1297 -2.4412 -0.3295
dipole: 2.7100
quadrupole: -67.0827 -97.7528 -94.1115
quadrupole: -4.6837 1.7477 1.7520
quadrupole: 19.2329 -11.4371 -7.7958 -4.6837 1.7477 1.7520
hfenergy: -727.3264621 hartree
pointgroup: C01 [X(C13H12O3)]
dipole: -0.436644 -0.913403 -0.3344063 debye
polarizability: 255.4798151|1.856055|133.8241646|19.3493102|28.3242386|88.7570495 unknown
InChI: InChI=1S/C13H12O3/c1-16-12(14)8-10-7-6-9-4-2-3-5-11(9)13(10)15/h2-5,8H,6-7H2,1H3
charge 0 multiplicity 1
28 atoms
O  -0.27869 1.945858 1.073221
O  4.26922 0.29486 0.971546
O  3.462675 -1.318949 -0.506121
C  -0.816407 -1.935134 -0.496084
C  0.45151 -1.150935 -0.914928
C  -2.010956 -1.019038 -0.297064
C  -1.814663 0.3135 0.177039
C  0.735241 -0.01098 0.042617
C  -0.447375 0.834259 0.478757
C  -3.330911 -1.463159 -0.549593
C  -2.931659 1.163716 0.401411
C  1.961935 0.341687 0.539961
C  -4.436143 -0.612121 -0.330352
C  -4.237196 0.707634 0.14893
C  3.243123 -0.334496 0.249269
C  5.623378 -0.272614 0.78069
H  -0.606315 -2.479503 0.447378
H  -1.047375 -2.703674 -1.255921
H  0.279091 -0.719311 -1.923498
H  1.32722 -1.813103 -0.99455
H  -3.492244 -2.482734 -0.919311
H  -2.740545 2.17458 0.776538
H  2.01679 1.202528 1.216135
H  -5.450723 -0.972944 -0.533924
H  -5.095443 1.366165 0.318721
H  6.27748 0.344186 1.412276
H  5.918498 -0.210023 -0.280551
H  5.643981 -1.329357 1.097108
