program: Gaussian 09
title: 000246598
version: EM64L-G09RevD.01
frameworkgroup: C1[X(C14H8Cl4)]
method: RPBEPBE
basis: SDD
operation: Freq
keyword: #pfreq=noraman
keyword: PBEPBE/SDD
title: #p freq=noraman PBEPBE/SDD
converged: NO YES NO NO
title: Mulliken charges:
elementType: Cl Cl Cl Cl C C C C C C C C C C C C C C H H H H H H H H
charge: -0.037467 -0.052010 0.049915 0.043190 0.494211 0.344686 0.383492 -0.367137 -0.368926 -0.331044 -0.345641 -0.214836 -0.209379 -0.226367 -0.229523 -0.110965 -0.224658 -0.623292 0.261479 0.250670 0.262383 0.258194 0.256769 0.259712 0.237798 0.238745
chargesum: 0.00000
title: Mulliken charges with hydrogens summed into heavy atoms:
elementType: Cl Cl Cl Cl C C C C C C C C C C C C C C
charge: -0.037467 -0.052010 0.049915 0.043190 0.494211 0.344686 0.383492 -0.105657 -0.118256 -0.331044 -0.083259 0.043358 0.047390 0.033345 0.008275 -0.110965 0.014087 -0.623292
polarizability: 2.49944613e+02 -4.19093341e+00 1.83384425e+02 -2.15672948e+01 1.51849297e+01 1.40514370e+02
1716.lowfreq: -10.2666 -4.4540 0.0025 0.0027 0.0028 0.7266 25.4669 38.7989 45.6260
frequency: 25.4099 38.7967 45.6101 59.4985 61.3805 97.2506 130.3126 146.0309 191.7657 209.0903 237.7310 253.9407 277.7661 308.2588 338.2489 362.4904 381.4998 409.6596 415.3118 431.1426 456.0599 490.6578 526.4336 612.6319 619.6066 652.5226 659.3388 674.0616 719.3746 732.4453 759.3274 784.0803 804.7112 829.4654 837.5370 871.7190 930.9912 954.4851 960.1298 970.5013 989.8457 999.8047 1022.2947 1041.2568 1074.7641 1114.4228 1123.4421 1171.7866 1174.8092 1191.4964 1251.4363 1288.6875 1299.2129 1359.3417 1363.3851 1395.2949 1420.2889 1458.5310 1477.1760 1568.2674 1575.0427 1593.5884 1599.9637 1602.9328 3138.1642 3147.9464 3149.4647 3160.9827 3164.9998 3175.0465 3178.2166 3181.2629
redmass: 12.1159 9.3419 4.8408 12.2071 10.4875 10.1710 10.4254 5.1160 12.8722 11.4722 10.6079 9.2061 8.2974 6.6042 7.3088 7.6388 8.3730 3.0499 9.5584 7.3530 3.9849 3.4139 4.3871 6.6071 6.6358 6.3205 6.6514 7.5941 3.8390 4.6427 1.3687 4.2510 5.8444 1.2668 1.6725 1.4166 4.7923 1.3913 1.4657 1.3725 1.3337 4.1494 6.1129 2.2042 2.7316 1.3688 1.6985 1.7387 1.4220 1.1285 1.5946 2.3507 1.4265 6.3812 6.7476 3.7117 2.2219 2.5664 2.4559 6.1649 7.6351 6.7667 7.5851 9.1958 1.0859 1.0892 1.0908 1.0885 1.0957 1.0961 1.0997 1.0976
irintensity: 0.1964 0.2080 0.0920 0.0532 0.4509 0.7678 0.2996 0.1065 0.9334 0.5581 0.7047 0.4138 0.4540 0.2738 0.8348 2.2209 0.4013 1.4349 17.5810 7.7346 21.0016 14.0273 3.6195 24.2938 7.8747 4.3554 11.2037 18.8147 9.2030 0.5505 93.1766 39.8285 112.2833 2.0102 47.8744 0.8990 14.1547 1.1316 2.6785 0.2082 0.2259 50.8021 34.8363 9.8828 49.8740 6.7400 1.4722 3.7082 1.4312 0.6465 1.7656 3.9960 0.8915 0.7311 2.5154 7.4397 27.6839 15.4904 80.9788 8.7621 8.6098 13.5311 24.4445 28.8596 0.7009 5.1159 7.5295 2.2103 11.1313 4.6760 11.6834 0.7868
temp: 298.150 k
press: 1.00000 atm
elementType: 17 17 17 17 6 6 6 6 6 6 6 6 6 6 6 6 6 6 1 1 1 1 1 1 1 1
symmnumber: 1
zpe: 452908.8 jmol-1
zpe.correction: 0.172504 hartree
zpe.thermalcorrener: 0.189092 hartree
zpe.thermalcorrenthalpy: 0.190036 hartree
zpe.thermalcorrgfe: 0.125342 hartree
zpe.sumelectzpe: -2377.257861 hartree
zpe.sumelectthermal: -2377.241273 hartree
zpe.sumelectthermalent: -2377.240329 hartree
zpe.sumelectthermalfe: -2377.305024 hartree
dipole: 2.0883 -1.9011 -1.5952
dipole: 3.2435
quadrupole: -134.2367 -126.4775 -126.1870
quadrupole: -11.2039 -6.5440 5.5065
quadrupole: -5.2696 2.4895 2.7801 -11.2039 -6.5440 5.5065
hfenergy: -2377.430365 hartree
pointgroup: C01 [X(C14H8Cl4)]
dipole: -0.914854 0.5597189 -0.6914717 debye
dipolederiv: -0.2103831 0.0055771 -0.2322126 0.0438609 -0.0908056 -0.035707 -0.2139891 -0.0528512 -0.6059882 -0.856956 -0.3307405 -0.0269668 -0.3519512 -0.2418416 0.018744 -0.0269947 0.0178782 -0.0988942 -0.7892621 -0.3251756 0.03973 -0.2286639 -0.3149343 0.0165393 0.0437797 0.0509894 0.0158731 -0.4578003 0.3897913 0.0066541 0.2905381 -0.5781158 0.0229485 -0.0048688 0.013516 0.0175834 0.1121759 0.0386824 -0.0145781 -0.0408951 -0.0520421 0.0256585 -0.0059448 0.0092538 0.0034849 0.0561241 0.1484136 -0.022072 0.1207275 -0.0623187 0.0155418 0.0343311 0.0619946 -0.0064076 0.0266293 -0.1943056 -0.0718278 -0.1105947 0.0520267 -0.0105476 -0.0266757 -0.068596 -0.1918885 0.0266926 0.0647739 -0.0099801 -0.032332 -0.0360975 -0.0892554 0.0812643 -0.0438563 0.0088314 -0.0206924 -0.0436386 0.0661942 0.0998464 -0.0038523 -0.0456219 -0.0176151 -0.1085723 -0.0469079 0.1694291 0.0259591 0.4173868 -0.0780167 0.0336807 0.0161857 0.2891827 0.1533458 0.848948 -0.0737499 -0.0034492 0.0403725 -0.0181022 -0.0758325 0.0564469 0.0617075 0.0198362 0.0317104 -0.2886561 -0.1615047 0.0954108 -0.1786834 -0.1607461 -0.0167465 0.1127875 0.0072394 -0.0309705 -0.3782492 -0.0767516 -0.0474308 -0.0622432 -0.0739105 -0.0763157 -0.0939215 -0.0968481 -0.0474163 -0.1466217 -0.0068942 -0.1345349 0.0005068 -0.0651729 0.0916285 -0.0977641 0.0542782 -0.1998766 -0.0809808 0.0109332 0.1057161 -0.0029578 -0.1125465 -0.0021743 0.0962899 0.0207988 0.0437658 1.1691772 0.4976938 0.0717266 0.5303827 0.2494847 -0.0829007 0.0533347 -0.0773996 0.0560146 -0.0140588 -0.1238432 0.0396639 -0.107085 -0.004649 0.0499059 0.0552333 0.0213467 0.0344536 1.2458596 -0.0921848 -0.0691269 -0.0960229 1.0275536 -0.0520382 -0.0912154 -0.0978984 -0.1582519 0.0789646 -0.0483768 0.0290864 -0.0391537 0.0392105 0.0775873 0.0293478 0.0669177 0.0558909 0.0449305 0.0156383 -0.0988372 0.0328568 0.0847445 0.0359642 -0.1043645 0.0538245 0.0509793 0.1011221 0.0407547 0.0221598 0.0491229 0.0239275 -0.0823821 0.032282 -0.0682829 0.0257624 0.0199254 0.002641 -0.0757841 0.0028644 0.1177223 0.0498347 -0.0800033 0.0522409 0.0617048 0.0766013 -0.0484413 0.0081589 -0.0493126 0.0494093 0.0930181 0.0148748 0.0911705 0.0699353 0.1122287 0.050578 0.0027527 0.0587273 0.0581109 -0.0677384 0.0160088 -0.0812257 0.0321116 0.0652228 0.0438486 -0.0929828 0.0362168 0.1077995 -0.0179886 -0.1085325 -0.0070439 -0.0522295 0.0123271 0.1200211 -0.0486786 0.1303637 0.0291952 0.0094129 -0.0485345 0.0079437 0.0817816 unknown
polarizability: 246.1967309|9.9317033|183.7204484|29.4969645|-11.2876341|143.9262279 unknown
InChI: InChI=1S/C14H8Cl4/c15-10-7-5-9(6-8-10)13(14(17)18)11-3-1-2-4-12(11)16/h1-8H
charge 0 multiplicity 1
26 atoms
Cl -1.086469 1.017692 2.375122
Cl 5.238752 1.595082 0.147644
Cl -2.311127 -2.923747 0.154332
Cl 0.615038 -3.564332 0.191568
C  -0.35958 -0.921906 0.0047
C  1.017906 -0.340403 0.052797
C  -1.488613 0.041671 -0.228781
C  1.988099 -0.761534 1.002092
C  1.359419 0.703183 -0.84956
C  -1.884573 0.999715 0.735651
C  -2.170167 0.053244 -1.476034
C  3.270626 -0.177527 1.036556
C  2.640681 1.293231 -0.831794
C  -2.904051 1.939837 0.491569
C  -3.192993 0.986528 -1.743987
C  3.580442 0.83821 0.111668
C  -3.559272 1.933345 -0.760307
C  -0.629712 -2.254013 0.111783
H  1.737218 -1.531089 1.736692
H  0.620887 1.05685 -1.576212
H  -1.884507 -0.685021 -2.232777
H  4.01025 -0.498886 1.774994
H  2.899591 2.089376 -1.535063
H  -3.182074 2.657473 1.268421
H  -3.701574 0.974677 -2.713325
H  -4.352297 2.661846 -0.958647
