program: Gaussian 09
title: 000246592
version: EM64L-G09RevD.01
frameworkgroup: C1[X(C10H10Br2)]
method: RPBEPBE
basis: SDD
operation: Freq
keyword: #p
keyword: freq=noraman
keyword: PBEPBE/SDD
title: #p freq=noraman PBEPBE/SDD
converged: NO YES NO NO
title: Mulliken charges:
elementType: Br Br C C C C C C C C C C H H H H H H H H H H
charge: -0.016063 -0.016064 -0.490086 -0.490085 -0.511993 -0.511992 0.316873 0.316869 -0.375167 -0.375164 -0.246210 -0.246211 0.334767 0.334767 0.262951 0.263210 0.262951 0.263211 0.232291 0.232291 0.229427 0.229427
chargesum: 0.00000
title: Mulliken charges with hydrogens summed into heavy atoms:
elementType: Br Br C C C C C C C C C C
charge: -0.016063 -0.016064 -0.155319 -0.155318 0.014167 0.014170 0.316873 0.316869 -0.142876 -0.142873 -0.016782 -0.016783
polarizability: 1.44582016e+02 7.69223753e-03 1.40884908e+02 -1.16098604e-03 -1.13791062e+00 1.17285279e+02
1716.lowfreq: -10.0707 -7.3353 -0.0005 -0.0005 -0.0004 1.3826 35.9552 73.4137 109.7744
frequency: 35.9034 73.4102 109.7721 145.5406 174.8970 207.1811 281.4538 301.5724 355.3303 430.6693 465.8444 487.0435 499.2199 500.0633 564.5506 610.4715 712.1333 722.9410 744.2684 756.4149 850.4268 864.1087 872.0878 929.0703 957.0159 966.5372 989.6819 995.1567 1039.1840 1108.8880 1129.0508 1151.4069 1155.6454 1176.3627 1203.5769 1209.6124 1210.2140 1232.4888 1264.1817 1266.7892 1344.2527 1351.5274 1361.1446 1386.8155 1435.0678 1436.2503 1445.1248 1494.4122 1596.8648 1618.6658 2961.9932 2962.5297 3052.6707 3053.0899 3099.2395 3109.8607 3112.5167 3116.3606 3138.7381 3161.0341
redmass: 8.4175 7.5303 5.1215 5.8397 22.9558 5.8467 2.3130 2.0888 3.7611 2.5689 4.3295 5.7905 3.5637 5.4263 4.5258 4.2325 3.6446 4.1172 1.8849 2.0943 3.2997 2.0755 1.6827 1.8969 2.1390 1.6222 1.3385 2.2845 2.4276 1.8538 1.5350 1.1174 1.0893 1.0613 2.1312 1.1035 1.4667 1.4302 1.4610 2.7599 1.5524 1.4240 1.8822 4.7743 1.1211 1.1027 2.2501 2.5209 6.7883 6.4566 1.0675 1.0673 1.0917 1.0918 1.0868 1.0898 1.0869 1.0895 1.0925 1.1005
irintensity: 0.0408 1.2661 0.2283 2.9112 0.3005 0.5123 0.1817 9.7646 1.3135 1.6875 2.3557 34.1332 1.6693 64.1766 2.9535 8.1920 1.5816 0.1251 26.7809 21.4983 29.3170 0.0292 0.1313 23.8098 0.9898 27.3887 0.0122 5.7176 3.3196 14.1656 5.5264 19.5499 0.2896 0.0065 0.2853 22.6453 5.6267 14.3142 4.8347 0.0427 0.5519 3.5995 0.3700 0.5098 26.5701 0.0056 15.5304 21.8399 2.3428 0.1864 4.8989 14.7966 14.3415 0.1004 1.7033 9.3212 15.2977 2.4479 25.2487 30.2157
temp: 298.150 k
press: 1.00000 atm
elementType: 35 35 6 6 6 6 6 6 6 6 6 6 1 1 1 1 1 1 1 1 1 1
symmnumber: 1
zpe: 448529.8 jmol-1
zpe.correction: 0.170836 hartree
zpe.thermalcorrener: 0.181692 hartree
zpe.thermalcorrenthalpy: 0.182636 hartree
zpe.thermalcorrgfe: 0.131645 hartree
zpe.sumelectzpe: -413.128941 hartree
zpe.sumelectthermal: -413.118085 hartree
zpe.sumelectthermalent: -413.117141 hartree
zpe.sumelectthermalfe: -413.168132 hartree
dipole: 0.9579 0.0000 0.0000
dipole: 0.9579
quadrupole: -85.6963 -100.0893 -81.0166
quadrupole: -0.0005 0.0001 2.6783
quadrupole: 3.2378 -11.1552 7.9175 -0.0005 0.0001 2.6783
hfenergy: -413.2997769 hartree
pointgroup: C01 [X(C10H10Br2)]
dipole: 0.3768531 0.0000258 -0.0000197 debye
dipolederiv: -0.1823031 -0.0330573 0.0628113 -0.0691388 -0.4394505 0.296318 0.1533861 0.287618 -0.4985343 -0.1823782 0.0331197 -0.0628796 0.0692486 -0.4395067 0.296332 -0.1535522 0.2875665 -0.4985235 0.1954067 0.0028931 -0.1246719 0.0308139 0.4342858 -0.4259256 -0.3834479 -0.3901446 0.6136906 0.1955274 -0.0030533 0.124767 -0.0309477 0.4343473 -0.4258843 0.3835702 -0.3900933 0.6136417 0.0229734 0.0581449 -0.0014301 0.0071712 -0.0024892 0.0340928 0.0764801 -0.0042204 -0.1178215 0.0229883 -0.0581621 0.0014456 -0.0071994 -0.0024636 0.0340947 -0.0765306 -0.0042742 -0.1177654 0.1443704 0.1249751 0.0828217 0.1247035 -0.0127556 -0.0179162 0.2349636 0.0323376 -0.0132912 0.1443606 -0.1249346 -0.0828236 -0.1247274 -0.0127366 -0.0179777 -0.2349665 0.0324486 -0.0133342 -0.1199521 -0.0416655 -0.0213772 -0.0240457 0.0132563 0.1368735 -0.0322302 0.1188641 -0.0448852 -0.1197598 0.0418261 0.0212862 0.024024 0.0130953 0.1369371 0.0322007 0.1187325 -0.0448387 0.0345771 -0.0498608 -0.0333051 -0.0682487 -0.0574685 0.0721104 -0.0474828 0.0683503 -0.1098243 0.0342736 0.0495545 0.0333787 0.0683003 -0.0574773 0.0721551 0.0474201 0.0683284 -0.109796 -0.057934 -0.0472535 -0.012319 -0.0361099 0.0115552 0.0611065 -0.0274158 0.036324 -0.045499 -0.0579635 0.0473604 0.012305 0.0361271 0.0115275 0.0610994 0.0274542 0.0363187 -0.0455146 -0.0509793 -0.053011 0.0084687 -0.0050158 0.1066986 0.0567944 -0.0421341 0.0320932 -0.0723052 0.0196314 0.0205365 0.0022257 -0.0237559 -0.0932285 -0.0306738 -0.0108957 -0.0000811 0.1221267 -0.0509607 0.0529912 -0.0084847 0.0050306 0.1067052 0.0567819 0.0421329 0.0320993 -0.0723381 0.0196263 -0.0205375 -0.0022129 0.0237558 -0.0932587 -0.0306818 0.0109216 -0.0000591 0.1221155 0.084639 -0.0246618 -0.0221085 0.0062154 -0.0348202 -0.1245195 0.0025575 -0.1229699 0.0502873 0.084638 0.024674 0.022117 -0.0061916 -0.0347655 -0.1245579 -0.0024882 -0.1229527 0.0502612 -0.0904991 0.0714579 0.0539248 0.0790076 0.0744618 -0.058277 0.0588178 -0.0581495 0.1160692 -0.0902824 -0.0713358 -0.0539391 -0.0790169 0.074488 -0.058282 -0.0587609 -0.0581364 0.1160791 unknown
polarizability: 144.5820163|-0.0055049|131.484722|0.0052558|-11.6091445|126.685464 unknown
InChI: InChI=1S/C10H10Br2/c11-9-5-7-3-1-2-4-8(7)6-10(9)12/h1-4,9-10H,5-6H2
charge 0 multiplicity 1
22 atoms
Br -2.266143 -1.812057 1.552214
Br -2.26652 1.811886 -1.552018
C  -2.058426 -0.737737 -0.205512
C  -2.058485 0.737592 0.205687
C  -0.794677 -1.177058 -0.9501
C  -0.794702 1.177057 0.950134
C  0.498908 -0.571956 -0.420953
C  0.498891 0.572078 0.420864
C  1.735661 -1.131503 -0.828212
C  1.735627 1.131749 0.828006
C  2.962392 -0.571737 -0.416708
C  2.962375 0.572106 0.416383
H  -2.975578 -1.009304 -0.748099
H  -2.975606 1.009058 0.748376
H  -0.931287 -0.860648 -2.006095
H  -0.736298 -2.279525 -0.960026
H  -0.931167 0.860657 2.00615
H  -0.736435 2.27953 0.960029
H  1.732666 -2.016867 -1.476992
H  1.732605 2.017112 1.476787
H  3.907865 -1.019872 -0.741447
H  3.907834 1.020337 0.741031
