program: Gaussian 09
title: 000246587
version: EM64L-G09RevD.01
frameworkgroup: C1[X(C9H12O4)]
method: RPBEPBE
basis: SDD
operation: Freq
keyword: #pfreq=noraman
keyword: PBEPBE/SDD
title: #p freq=noraman PBEPBE/SDD
converged: YES YES NO NO
title: Mulliken charges:
elementType: O O O O C C C C C C C C C H H H H H H H H H H H H
charge: -0.205244 -0.181030 -0.402109 -0.217166 -0.170435 -0.099512 -0.433674 -0.372462 -0.428124 -0.410510 -0.377577 0.179807 0.169712 0.289780 0.256127 0.209178 0.220850 0.302184 0.218387 0.233636 0.218396 0.200580 0.214663 0.198846 0.385696
chargesum: 0.00000
title: Mulliken charges with hydrogens summed into heavy atoms:
elementType: O O O O C C C C C C C C C
charge: -0.205244 -0.181030 -0.016413 -0.217166 0.119345 0.156615 -0.003645 -0.070278 0.023899 0.008466 0.035932 0.179807 0.169712
polarizability: 1.20676639e+02 -6.76001052e-01 9.70758520e+01 -4.89837007e+00 -1.62318286e+00 8.71645982e+01
1716.lowfreq: -14.2857 -12.1516 0.0004 0.0007 0.0008 10.1101 38.6097 62.4196 102.8179
frequency: 38.5682 62.3898 102.7842 118.0910 160.9447 205.9150 238.2504 321.4450 363.1999 367.4334 412.3199 454.8651 479.1612 506.7307 555.1732 584.6404 619.1918 634.9849 685.4477 701.3351 783.4034 807.5956 844.2916 870.6991 901.8092 908.8595 922.0720 933.6029 981.8983 1006.6284 1041.6208 1056.2629 1068.7815 1073.7091 1113.8526 1130.0489 1145.5682 1196.2348 1208.4480 1222.7803 1245.9898 1249.2505 1281.6373 1311.1014 1317.5526 1321.6576 1333.7968 1342.7848 1350.5914 1362.0765 1377.8306 1464.3270 1470.5669 1474.0907 1481.8242 1659.2845 1704.1999 2973.3027 2977.1444 2977.9201 2989.3509 3009.4225 3034.2928 3036.1443 3042.8331 3048.5067 3051.3523 3071.8567 3512.1620
redmass: 9.2923 4.9980 4.7998 4.4535 3.3041 6.9430 2.9382 1.9876 4.4178 3.1365 4.7521 3.0995 3.8385 4.6772 3.1400 2.0809 3.4952 2.2049 3.7444 4.8649 2.2338 1.7506 3.0860 3.4687 2.4073 2.1899 2.8784 3.9288 3.0719 2.4295 2.4542 1.8956 1.9679 1.6931 1.3601 1.7810 2.7590 1.4097 1.4858 1.3934 1.2882 1.3860 1.3012 1.5411 1.5552 1.4839 1.3832 1.5441 1.5422 1.4846 1.5049 1.0841 1.0892 1.0821 1.0906 8.8333 12.7266 1.0676 1.0632 1.0618 1.0631 1.0835 1.0974 1.0836 1.0973 1.0976 1.0965 1.0950 1.0640
irintensity: 2.8556 0.8584 0.5156 2.0684 1.8755 0.4619 0.6642 0.2554 4.4332 1.0243 10.0238 3.6410 0.7222 4.8797 24.0902 61.9703 48.4661 41.3482 31.0327 10.3748 2.7960 9.4292 4.9166 0.6703 6.8470 42.5712 63.3653 25.4615 27.6095 102.7574 128.3373 157.9478 20.4638 30.2792 0.2740 7.3345 6.5710 22.6219 0.4929 34.9106 2.3727 2.4423 16.1882 13.5144 24.1742 4.1272 0.9927 8.2249 10.8714 9.3218 29.2456 8.9351 7.6797 18.9331 11.3641 248.2625 322.5854 16.8430 30.2283 31.8531 19.0031 7.7530 33.2586 3.1377 50.1467 46.8023 9.8857 59.5552 33.8593
temp: 298.150 k
press: 1.00000 atm
elementType: 8 8 8 8 6 6 6 6 6 6 6 6 6 1 1 1 1 1 1 1 1 1 1 1 1
symmnumber: 1
zpe: 528174.5 jmol-1
zpe.correction: 0.201171 hartree
zpe.thermalcorrener: 0.212698 hartree
zpe.thermalcorrenthalpy: 0.213642 hartree
zpe.thermalcorrgfe: 0.162941 hartree
zpe.sumelectzpe: -650.074002 hartree
zpe.sumelectthermal: -650.062475 hartree
zpe.sumelectthermalent: -650.061531 hartree
zpe.sumelectthermalfe: -650.112232 hartree
dipole: -3.9709 -3.8591 -0.7170
dipole: 5.5834
quadrupole: -72.0346 -84.9267 -78.1696
quadrupole: -7.7958 -4.0968 3.1265
quadrupole: 6.3424 -6.5497 0.2073 -7.7958 -4.0968 3.1265
hfenergy: -650.2751728 hartree
pointgroup: C01 [X(C9H12O4)]
dipole: -1.6748089 1.418018 0.0982386 debye
dipolederiv: -1.2358606 0.1213761 -0.2371641 -0.2810343 -0.596317 -0.1064373 -0.4414827 0.0151829 -0.4278291 -0.9503437 0.3112146 -0.2615869 0.2802378 -0.6700908 0.1435456 -0.3117714 0.1189836 -0.4135782 -0.5516904 -0.164196 -0.4185272 -0.1658075 -0.4962712 -0.3206042 -0.382982 -0.2868864 -0.8597028 -0.6257197 -0.2187374 0.2118562 -0.189111 -0.4098106 0.103127 0.0290879 0.0391264 -0.8637494 0.0406658 -0.0981976 0.0082107 0.0041679 -0.0447141 0.0050594 0.1347028 0.0158525 0.071675 0.6398936 -0.0363255 0.0063908 -0.2364181 0.3457117 -0.0216081 0.0134339 0.0354961 0.3601312 0.1095052 -0.027783 0.0418403 -0.0070998 0.0737652 0.000358 0.0017897 -0.0138449 0.1137952 -0.251648 -0.1158522 -0.0758663 -0.2219238 -0.6100212 0.0469609 -0.053996 0.0449808 0.0240863 -0.0348273 0.0453287 0.0590122 0.1006287 0.0145284 0.0457804 0.0634586 -0.024551 0.0147439 0.054341 0.0069501 0.0392398 0.0095145 0.0299793 -0.0008168 0.0262222 0.008565 0.0950206 0.0829222 -0.0086865 0.0126155 -0.0503354 0.0564114 0.0065869 0.096304 -0.0046997 0.1458617 1.5175088 -0.3812017 0.5730541 0.2407995 1.2340957 -0.0142863 0.7351718 -0.0893224 0.4666684 1.0814908 0.714562 0.0850483 0.6390821 0.6082567 0.1338031 0.1389423 0.1488427 1.4007041 0.0167261 0.0127015 0.0841908 0.0321911 0.0619563 -0.0039934 0.054976 -0.0148109 -0.0426558 -0.020672 -0.0233434 -0.0490945 -0.0190644 0.037106 -0.0399562 -0.0585814 -0.0431375 -0.0785086 -0.0366339 0.0561039 -0.1028579 0.0289947 0.0745796 -0.0204709 -0.0765814 0.027082 -0.1179851 -0.0247679 -0.1225412 0.0254627 -0.0836151 -0.1012441 0.0148741 0.0216054 -0.0258467 0.0701071 0.0865951 0.0016649 0.0456409 0.0055439 0.0892744 -0.017206 0.037177 -0.0020538 -0.0102085 -0.008121 0.0299302 -0.1021578 0.0000821 0.07777 -0.0398538 -0.0844977 -0.004871 -0.0888098 0.008046 -0.0863179 0.0209883 -0.1020645 -0.1262675 0.00762 0.0044139 -0.0156147 0.0793453 -0.0501301 0.1297789 0.0197556 0.1259969 -0.1167092 -0.0029384 0.0055776 0.0150343 0.0799146 0.0041767 -0.0516122 -0.107048 -0.035069 0.066836 0.025229 -0.0850937 -0.0129558 -0.132348 -0.0997859 -0.0096436 0.1160045 0.0099327 0.0431212 0.015054 0.1663769 0.0130202 -0.041613 0.0224437 -0.0005361 -0.0823207 0.0015931 0.0240162 -0.0054051 -0.1646163 -0.0110881 -0.1138766 0.2258854 -0.0846366 0.0873131 -0.087222 0.3340377 0.0455783 0.1303627 0.0675165 0.2688115 unknown
polarizability: 120.0819603|2.9231424|96.999385|5.8865265|-2.0424472|87.8357438 unknown
InChI: InChI=1S/C9H12O4/c10-8(11)7-5-3-1-2-4-6(5)13-9(7)12/h5-7,10H,1-4H2
charge 0 multiplicity 1
25 atoms
O  -0.038312 -1.971819 -0.300933
O  2.021922 -1.846153 0.766906
O  2.540889 1.536184 1.125606
O  2.404944 1.293653 -1.181753
C  -0.397059 0.354747 -0.811236
C  -1.135975 -1.003026 -0.65861
C  -1.330652 1.585587 -0.737324
C  0.70341 0.249355 0.272497
C  -2.207396 -1.028965 0.448618
C  -2.367248 1.506038 0.407435
C  -3.162993 0.182661 0.332278
C  1.024052 -1.277887 0.306234
C  1.945849 1.06097 -0.043224
H  0.12849 0.360662 -1.785846
H  -1.54481 -1.363065 -1.617241
H  -1.8760 1.661638 -1.699668
H  -0.721486 2.506151 -0.656133
H  0.347516 0.534347 1.279167
H  -1.708167 -1.001084 1.437465
H  -2.760752 -1.983824 0.400112
H  -3.051945 2.372518 0.343666
H  -1.864198 1.574582 1.393786
H  -3.916679 0.13467 1.139963
H  -3.718892 0.138968 -0.626867
H  3.388394 2.009095 0.901697
