program: Gaussian 09
title: 000246579
version: EM64L-G09RevD.01
frameworkgroup: C1[X(C8H14O2)]
method: RPBEPBE
basis: SDD
operation: Freq
keyword: #pfreq=noraman
keyword: PBEPBE/SDD
title: #p freq=noraman PBEPBE/SDD
converged: NO YES NO NO
title: Mulliken charges:
elementType: O O C C C C C C C C H H H H H H H H H H H H H H
charge: -0.207785 -0.201194 -0.100736 0.280234 -0.597901 -0.360908 -0.727904 -0.722690 -0.720695 0.186880 0.243837 0.251183 0.269180 0.219692 0.240914 0.221096 0.217638 0.214925 0.211046 0.209549 0.220043 0.212657 0.215327 0.225611
chargesum: 0.00000
title: Mulliken charges with hydrogens summed into heavy atoms:
elementType: O O C C C C C C C C
charge: -0.207785 -0.201194 0.143101 0.280234 -0.077538 0.099698 -0.074244 -0.082052 -0.067100 0.186880
polarizability: 1.05027794e+02 6.24442530e+00 8.72611100e+01 -2.97172561e-01 -1.01682994e-01 7.37797654e+01
1716.lowfreq: -25.2758 -15.1802 -8.0047 -0.0010 -0.0007 -0.0005 61.2694 75.7217 159.1533
frequency: 61.2383 75.6081 159.1473 182.0615 204.2447 249.2576 252.9638 285.9742 299.9996 325.7847 364.7667 414.4660 484.7280 496.0298 509.7319 569.9606 647.3858 759.0927 794.3066 853.3761 892.1575 924.4498 925.2657 940.5255 950.7411 983.1140 1003.2798 1012.3395 1048.4264 1099.7054 1108.4712 1143.9094 1177.5462 1218.6272 1223.1972 1244.6382 1263.6213 1309.8152 1318.8897 1349.2332 1378.2415 1381.6072 1407.7907 1440.2032 1461.9816 1464.5725 1466.5641 1479.7788 1487.9105 1490.7451 1495.4751 1707.5057 2967.6773 2970.9201 2972.3034 2978.0848 3006.5989 3016.7770 3060.9276 3066.4462 3067.6108 3068.6145 3071.4038 3075.5209 3096.3505 3108.4208
redmass: 3.1207 2.9390 4.1159 2.2786 1.2054 1.1475 1.0886 2.3078 2.6169 2.5510 2.1350 3.0110 2.5837 2.5447 3.1887 3.2595 8.4703 3.7819 4.7060 2.5462 1.5249 1.6955 1.6765 1.2186 7.3422 1.5179 2.1059 1.5173 1.8351 2.9387 4.0347 1.2746 1.3625 1.6335 2.6992 1.7760 2.2910 1.4143 1.2821 1.4801 1.1999 1.2039 1.2092 1.0869 1.0515 1.0485 1.0482 1.0752 1.0599 1.0563 1.0619 12.6163 1.0354 1.0371 1.0723 1.0458 1.0650 1.0631 1.1004 1.0994 1.0992 1.0993 1.0986 1.0980 1.0969 1.1039
irintensity: 1.3446 6.3753 1.3205 1.2076 0.1814 0.5219 0.0748 1.3981 0.3809 0.5862 0.4546 0.9921 0.0164 3.2945 1.2477 5.8956 2.4315 0.5732 26.7188 9.1905 1.3128 2.0487 2.4176 0.3339 90.2842 1.9099 16.2227 5.8712 28.2317 11.7981 119.9926 7.9409 1.6637 6.3331 3.6533 32.1946 2.5093 3.4277 0.6467 1.2340 22.2101 26.6756 13.3929 11.2884 0.6579 0.2754 0.2565 6.8849 6.7554 15.7278 24.8837 375.5492 31.1569 24.8771 33.1945 2.5936 10.8266 36.9268 8.0099 0.1230 44.4579 13.3761 59.8085 101.4304 6.5715 23.2152
temp: 298.150 k
press: 1.00000 atm
elementType: 8 8 6 6 6 6 6 6 6 6 1 1 1 1 1 1 1 1 1 1 1 1 1 1
symmnumber: 1
zpe: 540222.3 jmol-1
zpe.correction: 0.205760 hartree
zpe.thermalcorrener: 0.216675 hartree
zpe.thermalcorrenthalpy: 0.217619 hartree
zpe.thermalcorrgfe: 0.169786 hartree
zpe.sumelectzpe: -462.896475 hartree
zpe.sumelectthermal: -462.885560 hartree
zpe.sumelectthermalent: -462.884615 hartree
zpe.sumelectthermalfe: -462.932449 hartree
dipole: 5.7998 0.0340 -0.0651
dipole: 5.8002
quadrupole: -81.8435 -61.3371 -59.7097
quadrupole: -0.1437 0.1855 0.0008
quadrupole: -14.2134 6.2930 7.9204 -0.1437 0.1855 0.0008
hfenergy: -463.1022348 hartree
pointgroup: C01 [X(C8H14O2)]
dipole: 2.2818325 0.0182114 -0.0188072 debye
dipolederiv: -0.8109544 0.1276505 0.0097104 0.5300055 -1.0206324 0.0116449 -0.050021 0.0295975 -0.2790916 -1.2123652 0.3303128 -0.0035547 0.2502703 -0.6011679 0.0051963 -0.0002329 0.0043368 -0.3304492 0.0270235 0.0239566 -0.0132972 -0.0934061 -0.06229 -0.0054589 0.0050456 -0.0117728 0.1061305 0.2084254 0.008974 -0.0068726 0.0171825 0.1242762 -0.0002366 -0.0490685 -0.0002479 0.1360639 -0.400699 -0.112733 0.007426 -0.1702213 -0.1337414 0.0510195 0.0280878 0.0223875 0.1380234 0.5650073 -0.2143146 -0.0330991 -0.0329227 0.2490591 -0.018294 -0.0021171 0.0035185 0.3182277 -0.0292189 0.0510122 -0.01991 0.0495225 -0.0261231 0.0319622 0.005442 0.0313696 0.0394576 -0.0285309 -0.0059652 0.0185882 -0.0123887 0.0433128 0.0084797 0.0447069 0.0084738 -0.0906011 -0.003992 -0.0333073 -0.0151323 -0.03814 -0.049483 -0.0374486 0.0084491 -0.0374491 0.0351332 1.5728243 -0.2814581 0.0024459 -0.5988154 1.3718487 -0.0396524 0.0142515 -0.0476047 0.2025473 0.0358814 0.0095614 -0.0095448 0.0015128 0.0377494 -0.0036684 -0.0063543 -0.0015475 -0.1667008 0.1064645 -0.0304674 0.0180181 0.0019097 0.0764078 0.0297152 -0.007993 0.0616781 -0.0604299 0.0836693 0.0124702 0.0018287 0.0231622 -0.0292764 -0.0609209 -0.0104001 -0.0817353 0.0477167 -0.0173699 0.0754984 0.0359151 0.035475 0.0558666 -0.0344521 0.0696892 -0.090307 -0.1138202 0.0231597 0.0576515 -0.0136254 0.0505956 -0.0482889 0.0639542 -0.0269794 0.1103808 0.0120307 0.0750832 -0.082422 -0.0429004 -0.0532879 -0.1251533 -0.0657156 -0.0396775 -0.0955651 0.0397181 -0.1793134 0.0023438 0.037039 -0.0565051 0.0787353 0.0200022 0.0707328 0.0117203 0.0765921 0.0939802 0.0040718 0.0422841 0.0096384 0.0689394 0.002174 -0.0025567 0.0470247 -0.1742876 0.0312826 0.1137436 -0.0807788 0.1113696 -0.0664518 0.0912238 -0.0595567 0.0517076 0.0293799 0.0744299 -0.0815273 -0.0645662 -0.0754877 -0.0997632 -0.1163292 -0.0539887 -0.0679272 0.0189813 -0.1649109 -0.0283137 0.0996716 -0.0263241 0.0936752 0.0100575 0.0396858 0.0032591 0.0687733 0.0953018 -0.0038535 0.0313742 -0.0030939 0.0683033 0.0247708 -0.0029016 -0.031086 -0.1780632 -0.1751074 -0.0691952 0.0470111 -0.0176977 0.0756221 -0.0092627 0.079967 0.008894 0.0719624 0.0299289 0.1263104 -0.0480308 0.0976465 -0.0814241 0.041239 -0.0542101 0.0708943 0.0527055 unknown
polarizability: 105.2006327|-5.998573|87.0732412|-0.0951929|-0.4457758|73.7947955 unknown
InChI: InChI=1S/C8H14O2/c1-8(2,3)6-4-7(9)10-5-6/h6H,4-5H2,1-3H3
charge 0 multiplicity 1
24 atoms
O  -1.935306 -1.16502 0.100274
O  -3.332924 0.689295 0.022422
C  0.206248 -0.074189 0.453703
C  1.678133 0.12183 -0.039215
C  -0.84009 0.970299 -0.007917
C  -0.463385 -1.41219 0.035612
C  2.540616 -1.057232 0.492999
C  1.793411 0.174683 -1.586297
C  2.22205 1.451502 0.551339
C  -2.181877 0.228292 0.038815
H  0.23277 -0.052942 1.562986
H  -0.670736 1.299181 -1.050934
H  -0.893963 1.872707 0.620123
H  -0.222023 -1.706149 -1.001948
H  -0.255115 -2.249769 0.717621
H  2.231405 -2.023458 0.051994
H  3.60538 -0.902536 0.238432
H  2.464943 -1.143516 1.593668
H  1.242203 1.031292 -2.015847
H  1.421585 -0.748253 -2.068611
H  2.854234 0.290559 -1.875281
H  2.170412 1.448427 1.656637
H  3.278812 1.60085 0.262104
H  1.64732 2.321937 0.184721
