program: Gaussian 09
title: 000246577
version: EM64L-G09RevD.01
frameworkgroup: C1[X(C7H3Br3O2)]
method: RPBEPBE
basis: SDD
operation: Freq
keyword: #p
keyword: freq=noraman
keyword: PBEPBE/SDD
title: #p freq=noraman PBEPBE/SDD
converged: NO YES NO NO
title: Mulliken charges:
elementType: Br Br Br O O C C C C C C C H H H
charge: 0.068463 0.068470 0.058853 -0.373976 -0.178242 0.557208 -0.332909 -0.333039 -0.162137 -0.162110 -0.196139 0.029664 0.281822 0.281816 0.392256
chargesum: 0.00000
title: Mulliken charges with hydrogens summed into heavy atoms:
elementType: Br Br Br O O C C C C C C C
charge: 0.068463 0.068470 0.058853 0.018279 -0.178242 0.557208 -0.332909 -0.333039 0.119685 0.119706 -0.196139 0.029664
polarizability: 1.79739266e+02 5.44309571e-03 1.58244809e+02 -1.13399699e+00 -7.32931302e-04 5.56222029e+01
1716.lowfreq: -7.6882 0.0005 0.0006 0.0006 3.8330 4.4106 28.5994 48.2050 100.4240
frequency: 28.5532 48.1868 100.4229 109.4563 115.6432 119.8046 176.9795 192.0433 220.8460 234.9960 342.0905 392.0983 429.4116 461.7336 501.3797 573.5392 605.3508 637.7019 709.8988 716.2268 737.7436 770.3081 868.1710 879.9282 990.6596 1057.9043 1093.9136 1170.7470 1186.2614 1297.9493 1336.1913 1355.2997 1416.2797 1536.0144 1564.7364 1658.2966 3187.7421 3189.9527 3499.2475
redmass: 10.1929 13.1594 12.2426 28.9428 39.0857 11.5225 4.5462 7.9631 73.3353 16.2238 9.2767 5.2491 9.4540 8.4369 5.0505 3.7012 1.3009 5.1437 10.3916 5.5360 7.0116 7.3328 1.4526 1.3681 7.4031 3.0958 3.1498 1.8087 1.6485 2.4492 3.6426 5.3980 3.2637 9.7703 8.7687 10.1602 1.0932 1.0941 1.0639
irintensity: 1.9599 0.3092 0.3485 0.0572 0.0243 0.1293 0.0008 2.3972 0.0191 0.1237 3.6640 0.6285 5.4787 42.6722 0.3243 7.2794 91.9187 11.7052 37.2081 74.5909 18.0797 62.4855 32.6018 0.0000 125.7004 159.6116 16.6518 31.1716 22.2979 67.3310 49.2892 24.2354 39.3700 116.8122 158.2528 241.7445 1.5449 0.5615 38.0693
temp: 298.150 k
press: 1.00000 atm
elementType: 35 35 35 8 8 6 6 6 6 6 6 6 1 1 1
symmnumber: 1
zpe: 212419.2 jmol-1
zpe.correction: 0.080906 hartree
zpe.thermalcorrener: 0.093134 hartree
zpe.thermalcorrenthalpy: 0.094079 hartree
zpe.thermalcorrgfe: 0.038157 hartree
zpe.sumelectzpe: -458.509069 hartree
zpe.sumelectthermal: -458.496841 hartree
zpe.sumelectthermalent: -458.495897 hartree
zpe.sumelectthermalfe: -458.551818 hartree
dipole: -0.4191 0.0000 1.3587
dipole: 1.4219
quadrupole: -89.4856 -91.2838 -102.6117
quadrupole: -0.0013 7.1794 -0.0009
quadrupole: 4.9748 3.1765 -8.1513 -0.0013 7.1794 -0.0009
hfenergy: -458.5899751 hartree
pointgroup: C01 [X(C7H3Br3O2)]
dipole: -0.1694465 -0.0001886 -0.533125 debye
dipolederiv: -0.1789613 -0.2415607 0.0025417 -0.2432067 -0.5639986 -0.0003528 -0.0003386 0.0057914 0.0164913 -0.1789932 0.2416197 0.0023739 0.2431067 -0.5640868 0.000723 -0.0004827 -0.0054393 0.016496 -0.7523092 0.0000202 0.0015582 0.0000476 -0.0568141 0.0000193 0.0006673 0.000003 -0.0007747 -0.5548969 0.0000383 0.4375004 0.0000127 -0.3570492 0.0002013 0.4259106 -0.0001245 -1.016988 -0.7998891 -0.0001147 -0.2905274 -0.0001928 -0.2899162 -0.0004102 0.0033449 -0.0001664 -0.834308 -0.3749127 0.0000199 0.028747 0.0004531 -0.6211928 0.0002609 -0.0162814 0.0000948 -0.0064787 0.4582677 0.440593 -0.0111671 0.2979385 1.0376928 0.0042574 0.0024391 -0.0081515 -0.1095281 0.4584116 -0.4404705 -0.0109344 -0.2982655 1.0378491 -0.0050466 0.0026385 0.0074868 -0.1095344 -0.600841 -0.2569743 0.0027646 -0.1769268 -0.3297897 0.0008473 0.0102821 0.0021905 -0.0287757 -0.6007492 0.2567278 0.0027191 0.1772601 -0.3304642 -0.0005602 0.0101544 -0.0019744 -0.0287863 1.383656 -0.0001505 -0.0035478 0.000118 0.2821767 -0.0000666 -0.0049551 -0.0001225 -0.1158167 1.4398385 0.00011 -0.078742 0.0002108 0.3291633 0.0001986 -0.2962557 0.0003661 1.5926152 0.0779969 0.0355957 -0.0003613 0.0363464 0.0404354 0.0001282 -0.0018265 -0.0004043 0.1625566 0.0777958 -0.035434 -0.000408 -0.0367276 0.0407853 -0.0001833 -0.001808 0.0004741 0.1625534 0.145586 -0.0000199 -0.0825167 -0.0001744 0.3452089 -0.0000163 -0.1334889 -0.0000238 0.3002781 unknown
polarizability: 179.749587|-0.0027739|158.2447991|0.0706387|-0.0299463|55.611892 unknown
InChI: InChI=1S/C7H3Br3O2/c8-3-1-4(9)6(7(11)12)5(10)2-3/h1-2,11H
charge 0 multiplicity 1
15 atoms
Br 0.807462 2.920309 0.003219
Br 0.807163 -2.920849 0.004882
Br -4.183216 -0.000024 0.010527
O  2.643427 -0.000075 -1.232265
O  2.801357 0.00059 1.090787
C  0.599725 -0.000248 0.006619
C  -0.135935 1.209615 0.005333
C  -0.136044 -1.210048 0.006003
C  -1.545326 1.232129 0.00676
C  -1.545438 -1.23242 0.007443
C  -2.229643 -0.000114 0.008005
C  2.107736 -0.000306 0.055643
H  -2.088071 2.179338 0.005803
H  -2.088272 -2.179578 0.007016
H  3.639175 0.000381 -1.180075
