program: Gaussian 09
title: 000246573
version: EM64L-G09RevD.01
frameworkgroup: C1[X(C12H27NO2)]
method: RPBEPBE
basis: SDD
operation: Freq
keyword: #p
keyword: freq=noraman
keyword: PBEPBE/SDD
title: #p freq=noraman PBEPBE/SDD
converged: YES YES NO NO
title: Mulliken charges:
elementType: O O N C C C C C C C C C C C C H H H H H H H H H H H H H H H H H H H H H H H H H H H
charge: -0.265127 -0.283994 -0.135713 -0.045654 -0.027638 -0.417451 -0.016163 -0.704919 -0.700141 -0.701771 -0.688105 -0.240484 -0.201998 -0.682341 -0.682767 0.247338 0.195079 0.224780 0.217531 0.222296 0.210343 0.208502 0.210023 0.231790 0.207106 0.197062 0.211654 0.208924 0.235958 0.228597 0.199869 0.206632 0.197909 0.223167 0.192124 0.212389 0.203221 0.221009 0.226327 0.204199 0.224008 0.226428
chargesum: 0.00000
title: Mulliken charges with hydrogens summed into heavy atoms:
elementType: O O N C C C C C C C C C C C C
charge: -0.265127 -0.283994 -0.135713 0.201684 0.167441 0.024860 0.206133 -0.076051 -0.064183 -0.045236 -0.053007 0.180592 0.202515 -0.031783 -0.028132
polarizability: 1.63394804e+02 5.47378226e-01 1.54943958e+02 5.53272538e-01 -1.80497885e+00 1.26579925e+02
1716.lowfreq: -14.7980 -9.1565 0.0004 0.0007 0.0008 5.2711 23.6990 32.9631 39.6550
frequency: 23.3866 32.7269 39.1053 53.2185 63.0157 76.6036 101.8108 106.9435 128.6475 163.3511 179.0196 189.8529 195.8490 205.8401 231.1022 237.4872 241.3203 254.5816 261.1039 274.0376 305.7281 318.1958 349.8638 361.5126 387.0413 412.1462 471.5258 485.6393 550.0835 557.5325 632.2126 699.7302 757.0671 807.3688 817.2754 824.1543 846.3903 870.5765 886.3174 902.3530 904.7536 922.2729 928.6672 952.3006 992.1639 1024.0131 1037.6857 1052.5086 1064.8911 1086.8304 1108.1588 1116.4948 1122.9346 1128.9402 1136.9476 1142.1307 1143.9105 1162.5288 1184.0998 1208.7869 1245.0316 1248.5064 1259.4529 1277.3920 1300.0265 1325.0152 1342.7344 1351.8879 1361.1371 1364.2250 1364.9474 1368.4347 1377.2177 1381.0955 1387.2277 1391.5289 1392.1131 1395.9784 1450.6307 1458.9503 1459.7175 1459.8644 1461.9494 1468.4066 1472.3521 1476.3757 1477.7884 1478.2848 1481.5576 1485.5751 1488.1600 1493.3261 1496.4478 2895.2920 2947.1576 2953.9726 2966.3564 2971.0184 2974.6529 2978.3469 2989.0551 2991.1504 3006.4935 3008.0602 3012.9007 3013.3733 3023.5619 3059.0711 3059.4706 3062.7195 3066.3787 3072.2884 3072.7608 3085.4746 3086.7121 3088.2030 3089.4674 3090.3112 3095.1615 3097.1812
redmass: 3.2475 2.6245 2.5915 2.4106 2.3525 2.4263 2.8227 2.1424 3.0777 3.0061 2.0837 2.3326 1.1545 1.1991 1.2716 1.2151 2.0686 1.5379 2.6797 1.0823 2.5456 2.5944 3.2429 2.4365 2.3983 2.9893 2.6893 3.0451 2.5244 2.5623 4.2341 3.0412 3.2821 1.1052 1.1266 2.4822 2.7747 2.5990 2.6634 1.2462 1.3297 1.3804 1.3281 2.9621 2.7373 2.4209 2.3566 2.4424 2.7428 2.4396 2.0754 2.2591 2.2192 2.2595 1.4470 1.5714 2.2129 2.0337 2.2326 2.6159 1.1621 1.2614 1.2056 1.2364 1.3535 1.2974 1.2169 1.3339 1.2698 1.3134 1.2264 1.2181 1.3190 1.2411 1.2277 1.2791 1.2585 1.3025 1.0678 1.0414 1.0409 1.0493 1.0512 1.0536 1.0526 1.0493 1.0507 1.0498 1.0444 1.0513 1.0542 1.0817 1.0834 1.0702 1.0604 1.0601 1.0346 1.0355 1.0367 1.0358 1.0359 1.0360 1.0864 1.0839 1.0854 1.1012 1.1014 1.0991 1.0992 1.0993 1.0915 1.0949 1.0972 1.0996 1.0990 1.0989 1.0997 1.0989 1.1011 1.1010
irintensity: 0.0858 0.0209 0.1223 0.3221 1.1471 0.8686 1.0284 0.8863 3.8679 6.2080 0.3198 5.0589 0.1342 0.0333 0.4778 1.2970 1.1550 6.0891 1.4339 0.1433 0.5014 1.5379 11.9821 2.1235 1.3976 2.0893 7.6298 4.4652 18.2968 5.9768 0.7241 4.8842 16.0847 2.2928 6.3805 2.1870 13.7468 34.2612 25.2697 2.6254 3.9933 0.6936 2.7986 126.3194 67.2393 37.9566 37.7446 125.2714 83.0400 24.8737 5.2308 2.5846 32.3473 13.5031 7.7960 4.0732 21.9517 13.6086 64.9873 62.0892 0.0640 13.3108 19.0423 15.5360 4.3417 5.3472 12.3800 6.6673 4.6005 8.7284 0.9103 40.7809 1.0682 19.3613 10.6768 35.8109 16.1728 13.7891 4.1874 9.2734 10.8404 0.7172 3.6547 8.5489 3.4670 18.0410 2.3242 9.3937 3.5346 13.4632 6.1055 9.1135 0.7504 54.7573 54.9381 53.7662 28.2839 26.7092 28.4605 31.2051 28.9949 28.9421 49.5897 10.4510 2.4916 23.2732 25.6743 3.9209 14.4336 40.0597 20.7242 42.4326 145.9259 17.4732 31.6465 39.8824 44.9648 34.2646 45.6884 41.5285
temp: 298.150 k
press: 1.00000 atm
elementType: 8 8 7 6 6 6 6 6 6 6 6 6 6 6 6 1 1 1 1 1 1 1 1 1 1 1 1 1 1 1 1 1 1 1 1 1 1 1 1 1 1 1
symmnumber: 1
zpe: 985260.3 jmol-1
zpe.correction: 0.375266 hartree
zpe.thermalcorrener: 0.395754 hartree
zpe.thermalcorrenthalpy: 0.396699 hartree
zpe.thermalcorrgfe: 0.325260 hartree
zpe.sumelectzpe: -677.354374 hartree
zpe.sumelectthermal: -677.333886 hartree
zpe.sumelectthermalent: -677.332941 hartree
zpe.sumelectthermalfe: -677.404380 hartree
dipole: -0.2991 0.2180 -0.5769
dipole: 0.6854
quadrupole: -89.0755 -94.4218 -98.0097
quadrupole: -0.0838 -0.9619 -3.6003
quadrupole: 4.7602 -0.5861 -4.1740 -0.0838 -0.9619 -3.6003
hfenergy: -677.7296401 hartree
pointgroup: C01 [X(C12H27N1O2)]
dipole: -0.1413729 0.2294927 0.0082284 debye
polarizability: 163.0019398|1.479707|129.3181121|1.415361|8.6070145|152.5986345 unknown
InChI: InChI=1S/C12H27NO2/c1-7-14-12(15-8-2)9-13(10(3)4)11(5)6/h10-12H,7-9H2,1-6H3
charge 0 multiplicity 1
42 atoms
O  -1.52429 -0.42282 0.936428
O  -1.870774 -0.220474 -1.445969
N  1.534812 -0.114256 0.017428
C  1.613882 0.137645 1.486299
C  2.791662 -0.02095 -0.780449
C  0.312672 0.370521 -0.645404
C  -0.910386 -0.538382 -0.393668
C  2.079997 1.571388 1.877359
C  2.470728 -0.932026 2.20224
C  3.064586 1.365994 -1.43722
C  2.841034 -1.140932 -1.848427
C  -2.061269 0.916909 1.271075
C  -2.996204 -1.177312 -1.525307
C  -3.060603 0.72459 2.412663
C  -3.917672 -0.70495 -2.64881
H  0.577712 0.0038 1.849471
H  3.615862 -0.21294 -0.067385
H  0.467329 0.354942 -1.737275
H  0.046457 1.421946 -0.383005
H  -0.605921 -1.603556 -0.429942
H  1.951606 1.736204 2.963981
H  3.149227 1.725137 1.63952
H  1.493167 2.343746 1.344651
H  2.118181 -1.94261 1.932477
H  2.393008 -0.811176 3.298851
H  3.542549 -0.855529 1.938737
H  4.054286 1.363226 -1.932018
H  2.310052 1.602055 -2.210763
H  3.056206 2.178634 -0.690468
H  2.731373 -2.128727 -1.36848
H  3.797657 -1.11692 -2.404265
H  2.023522 -1.027824 -2.586098
H  -1.232544 1.585964 1.585055
H  -2.544393 1.352631 0.374846
H  -2.592863 -2.191879 -1.734141
H  -3.522877 -1.211304 -0.550993
H  -3.474931 1.698899 2.73174
H  -3.89497 0.07554 2.093989
H  -2.571747 0.251257 3.282149
H  -4.775653 -1.39351 -2.757648
H  -4.305781 0.30594 -2.433415
H  -3.374192 -0.667392 -3.608812
