program: Gaussian 09
title: 000246470
version: EM64L-G09RevD.01
frameworkgroup: C1[X(C15H14N2O2)]
method: RPBEPBE
basis: SDD
operation: Freq
keyword: #p
keyword: freq=noraman
keyword: PBEPBE/SDD
title: #p freq=noraman PBEPBE/SDD
converged: YES YES NO NO
title: Mulliken charges:
elementType: O O N N C C C C C C C C C C C C C C C H H H H H H H H H H H H H H
charge: -0.405705 -0.231522 -0.115522 -0.114043 0.447813 -0.616942 -0.385695 -0.340759 0.159244 -0.289992 -0.344479 0.444304 0.162865 -0.328095 -0.396750 -0.293482 -0.337113 -0.805110 0.212939 0.249097 0.242898 0.235382 0.260640 0.275665 0.251404 0.231152 0.234340 0.274110 0.249415 0.226457 0.235748 0.233174 0.378561
chargesum: 0.00000
title: Mulliken charges with hydrogens summed into heavy atoms:
elementType: O O N N C C C C C C C C C C C C C C C
charge: -0.027144 -0.231522 -0.115522 -0.114043 0.447813 -0.124948 -0.150313 -0.080119 0.159244 -0.014326 -0.093074 0.444304 0.162865 -0.096943 -0.162410 -0.019372 -0.087698 -0.109732 0.212939
polarizability: 4.34081849e+02 3.85827758e+00 1.72163978e+02 1.71702189e+01 1.07882200e+00 9.25632153e+01
1716.lowfreq: -3.1434 -0.0008 -0.0006 0.0004 2.1372 9.8858 18.4210 25.5363 34.6302
frequency: 18.2716 25.4033 34.6232 37.6129 39.3774 57.7315 72.8723 108.7059 171.8186 189.1876 198.6434 252.5993 302.4826 335.7078 353.9870 377.7940 400.3912 411.3079 414.5451 450.7371 498.5727 517.3353 526.4279 549.8905 575.2742 627.2148 633.1833 636.6229 692.4536 719.7429 732.1037 762.1221 804.9591 828.5955 836.7923 842.9791 849.7500 851.9125 882.6790 899.1921 930.7572 971.7188 980.0796 986.2648 990.0699 992.5587 1003.5422 1004.1688 1045.7460 1055.1402 1108.2899 1113.7369 1139.1730 1159.5228 1178.2182 1191.4177 1202.1915 1221.6234 1238.0019 1271.1442 1296.8184 1299.6370 1321.6717 1354.2654 1374.7131 1388.4949 1398.2994 1416.5849 1422.1191 1455.1076 1468.5693 1473.5260 1482.2170 1490.1598 1573.4156 1577.2134 1609.5806 1613.5557 1662.8604 2976.2499 3023.9672 3053.2516 3088.1240 3104.7275 3121.5132 3129.9111 3130.7027 3140.0336 3160.2531 3163.7125 3166.0311 3168.1181 3506.4830
redmass: 5.3298 4.3779 5.4684 1.2040 3.7025 4.8476 5.1063 6.8649 5.5994 4.7637 6.6858 5.6283 3.8955 5.3634 3.0560 4.6956 2.3817 2.9947 3.0129 4.8544 2.7553 6.1059 3.6958 2.6924 3.8471 6.0481 1.7966 5.6263 3.2926 3.3020 3.2506 4.7576 3.9536 3.1912 3.0730 1.6614 1.2601 1.2880 2.5231 6.8364 1.9984 1.3572 1.3773 1.4345 1.3679 1.3519 2.7214 2.6324 1.5720 1.9022 1.3828 1.2720 2.1657 1.2826 1.2221 1.5901 2.3629 2.6111 3.8576 1.4424 1.3481 1.4039 2.1418 7.0882 4.3372 5.4148 1.2763 3.6207 3.4174 1.1114 1.0479 1.1424 2.3900 2.5697 6.4506 6.5629 6.4211 6.3866 8.5699 1.0377 1.0613 1.0970 1.0987 1.1011 1.0896 1.0897 1.0888 1.0887 1.0956 1.0960 1.0946 1.0950 1.0639
irintensity: 0.2588 1.4164 2.3948 0.3618 0.3756 1.1302 0.2421 0.1312 0.1378 0.0340 0.3360 0.8158 2.6244 1.2748 1.0836 4.7381 6.6643 0.9190 0.6878 22.8304 4.2703 12.1136 36.6478 26.6021 40.3679 6.2788 91.6307 20.4111 78.5236 2.4756 8.8762 0.1800 2.3143 8.8053 4.0777 71.1108 1.3837 9.4772 21.9546 2.3110 34.7082 2.7129 5.6990 7.4992 2.2534 1.4952 17.0060 7.9782 13.8593 222.5262 17.3034 37.9981 3.7054 61.7172 28.6204 0.1446 7.5661 2.2524 37.3226 1.9661 4.5780 5.0680 88.4193 4.2965 1.4730 18.4183 9.0442 15.3759 3.0318 15.6838 13.5671 12.1137 2.8249 34.4162 5.1923 0.7006 25.1511 88.0528 228.7813 37.0644 14.4261 18.9310 21.3954 4.8429 23.2911 19.6821 22.7558 6.8697 14.7018 7.6289 7.7725 4.8101 24.7876
temp: 298.150 k
press: 1.00000 atm
elementType: 8 8 7 7 6 6 6 6 6 6 6 6 6 6 6 6 6 6 6 1 1 1 1 1 1 1 1 1 1 1 1 1 1
symmnumber: 1
zpe: 669411.5 jmol-1
zpe.correction: 0.254965 hartree
zpe.thermalcorrener: 0.272432 hartree
zpe.thermalcorrenthalpy: 0.273376 hartree
zpe.thermalcorrgfe: 0.205435 hartree
zpe.sumelectzpe: -838.578672 hartree
zpe.sumelectthermal: -838.561206 hartree
zpe.sumelectthermalent: -838.560262 hartree
zpe.sumelectthermalfe: -838.628203 hartree
dipole: 1.3979 1.2320 0.0712
dipole: 1.8647
quadrupole: -82.8401 -105.9394 -110.2060
quadrupole: -9.7467 1.5678 1.0178
quadrupole: 16.8218 -6.2776 -10.5442 -9.7467 1.5678 1.0178
hfenergy: -838.8336376 hartree
pointgroup: C01 [X(C15H14N2O2)]
dipole: -0.5228772 -0.1505611 0.4920641 debye
polarizability: 433.4350461|-3.3333352|99.5169992|-20.4834675|-23.6398599|165.8569964 unknown
InChI: InChI=1S/C15H14N2O2/c1-11-2-6-13(7-3-11)16-17-14-8-4-12(5-9-14)10-15(18)19/h2-9,18H,10H2,1H3
charge 0 multiplicity 1
33 atoms
O  6.135493 1.247212 0.925212
O  5.933865 1.396131 -1.384809
N  -0.694512 -0.03897 -0.602067
N  -1.41912 -0.331791 0.449232
C  3.54334 -0.460336 -0.278291
C  5.064711 -0.600206 -0.201994
C  2.735152 -0.764058 0.850097
C  2.921158 -0.022095 -1.475707
C  0.716539 -0.206136 -0.413843
C  1.335665 -0.642618 0.79123
C  1.520427 0.103486 -1.5427
C  -5.666001 0.108059 0.149369
C  -2.828018 -0.16045 0.269185
C  -4.850199 0.423679 -0.976768
C  -5.030502 -0.346046 1.333486
C  -3.453366 0.295273 -0.92796
C  -3.628234 -0.479302 1.396415
C  -7.173212 0.263765 0.07544
C  5.744492 0.756544 -0.327858
H  5.429208 -1.223714 -1.037937
H  5.363568 -1.067368 0.74884
H  3.213941 -1.095212 1.77923
H  3.538236 0.229272 -2.345492
H  0.703222 -0.874744 1.65332
H  1.021106 0.440092 -2.457105
H  -5.330161 0.774345 -1.899095
H  -5.639454 -0.595549 2.210107
H  -2.823865 0.536759 -1.789873
H  -3.127354 -0.82831 2.305564
H  -7.664554 -0.091979 0.996856
H  -7.458077 1.32327 -0.070953
H  -7.594481 -0.303146 -0.775824
H  6.536887 2.152343 0.814794
