program: Gaussian 09
title: 000246560
version: EM64L-G09RevD.01
frameworkgroup: C1[X(C18H25NO4)]
method: RPBEPBE
basis: SDD
operation: Freq
keyword: #p
keyword: freq=noraman
keyword: PBEPBE/SDD
title: #p freq=noraman PBEPBE/SDD
converged: YES YES NO NO
title: Mulliken charges:
elementType: O O O O N C C C C C C C C C C C C C C C C C C H H H H H H H H H H H H H H H H H H H H H H H H H
charge: -0.433291 -0.225740 -0.252725 -0.264075 -0.451839 0.292724 0.291390 -0.311911 -0.540538 -0.493381 -0.799636 -0.768164 -0.794765 0.089073 0.137235 0.492914 -0.475642 -0.325440 -0.329856 -0.373441 0.341347 -0.244153 -0.684665 0.231046 0.212787 0.273576 0.276963 0.219692 0.209323 0.263232 0.226827 0.220868 0.249737 0.240146 0.257553 0.225337 0.224578 0.308961 0.378221 0.217580 0.309684 0.244761 0.250357 0.205787 0.205815 0.206076 0.232829 0.232846
chargesum: 0.00000
title: Mulliken charges with hydrogens summed into heavy atoms:
elementType: O O O O N C C C C C C C C C C C C C C C C C C
charge: -0.055070 -0.225740 -0.252725 -0.264075 -0.142878 0.292724 0.291390 -0.080864 -0.054176 0.003274 -0.100255 -0.057413 -0.087298 0.089073 0.137235 0.492914 -0.258062 -0.015756 -0.085096 -0.123085 0.341347 0.167449 -0.012914
polarizability: 3.34624538e+02 -1.61862632e+01 1.87606797e+02 -4.59792960e+00 -1.66089920e+01 1.57816502e+02
1716.lowfreq: -3.8217 -0.0013 -0.0005 0.0005 3.6764 13.6622 18.3896 27.5063 32.2137
frequency: 17.9632 27.4223 32.1475 45.7732 59.3363 77.5192 88.2828 98.9432 113.1048 124.8594 157.4508 162.9370 177.9224 216.2662 224.0706 240.6636 244.0516 257.3491 259.3140 265.5761 287.9763 308.7763 317.3647 337.9634 351.0659 367.9254 376.8800 389.7796 409.6557 414.8802 425.5299 437.1578 522.2209 532.9621 549.4419 573.7535 596.9286 624.1826 625.1632 635.7085 651.8674 703.9600 721.9196 729.6588 736.7855 744.9573 793.9911 797.6749 820.3986 829.6754 839.5363 853.0185 865.6499 890.9461 902.6020 918.1784 941.4552 951.1084 974.8212 985.7019 987.1697 999.7323 1003.3597 1006.0119 1022.3420 1037.6311 1067.9436 1088.2436 1115.5093 1120.6606 1124.0266 1134.9757 1135.7888 1166.4822 1180.5467 1183.2380 1186.9527 1215.9231 1219.3850 1230.4698 1244.1110 1259.7691 1268.0413 1277.0667 1283.5817 1294.3741 1302.7832 1320.7703 1349.7861 1361.6940 1375.5716 1383.7874 1390.8367 1398.9026 1406.5490 1423.1404 1460.3967 1461.3199 1466.1151 1474.8345 1476.5542 1480.2730 1480.9170 1486.9109 1489.7525 1495.1965 1499.2773 1501.6588 1507.6118 1589.7042 1616.4398 1629.5240 1646.5908 2949.2008 2969.3309 2974.0406 2989.3993 2990.2765 2997.1554 3006.5666 3011.2917 3023.7579 3059.8198 3064.9382 3074.8718 3077.9394 3085.4200 3087.1029 3094.4775 3099.1374 3106.2346 3109.7728 3110.7102 3160.9053 3165.8153 3196.2126 3504.7784 3522.8968
redmass: 4.9524 3.3952 3.8835 4.8635 7.2778 3.3383 4.5432 3.5784 1.8772 5.6925 3.8169 4.4010 4.7058 1.4185 2.4105 1.3639 1.3067 2.5309 2.0132 1.4825 2.2796 2.8687 2.8643 2.4789 3.0729 4.3136 4.8787 3.2509 3.8625 3.1540 4.1820 2.9055 2.6969 3.4098 4.3754 3.6533 1.6717 4.2762 3.7128 3.2135 1.1568 3.8914 3.5965 4.9804 3.8875 3.4811 3.6410 1.3574 1.8240 1.1138 3.1405 1.4893 2.5252 2.7280 3.2825 1.3885 1.4464 1.8625 3.4532 1.8363 1.3249 2.7371 2.2322 1.5554 2.5990 2.8409 2.1101 2.0669 2.0835 2.5218 1.3781 1.9543 1.4363 2.9123 2.1818 1.2876 2.2716 2.3610 2.2392 1.9852 1.2720 1.1443 2.4170 1.6807 1.5650 1.5043 1.4257 1.6206 1.8614 1.4972 2.3171 1.2531 1.1899 1.2878 1.1937 4.1217 1.0401 1.0548 1.0498 1.0669 1.0878 1.0546 1.0729 1.1835 1.0602 1.1147 1.6711 1.0842 2.3458 6.6829 4.1455 6.4332 8.8076 1.0552 1.0781 1.0403 1.0368 1.0377 1.0361 1.1074 1.0603 1.0634 1.0992 1.1025 1.0991 1.0985 1.0978 1.1029 1.0989 1.0993 1.1013 1.0898 1.0990 1.0906 1.0931 1.0953 1.0638 1.0762
irintensity: 0.4314 0.1354 0.4643 0.0609 0.3957 1.1853 1.4354 2.3385 3.5027 3.3220 2.0561 0.4877 0.3655 0.9376 1.3005 0.5016 1.3163 0.2097 0.5986 2.9599 4.1175 4.4203 2.6548 4.2975 7.2130 0.7489 3.8271 1.3380 5.5814 0.9362 2.0560 10.4549 22.3651 8.2308 8.9005 34.3751 60.5921 22.7708 23.6255 20.6015 57.6156 2.2653 0.3050 27.6447 0.7861 5.8046 15.6760 47.6095 3.7587 0.0771 3.7276 62.3558 0.2152 6.7943 50.6280 1.8496 1.8733 4.1054 3.9016 22.4618 6.0206 2.3209 33.7853 14.6434 180.2000 87.7739 20.0482 9.9563 3.7263 11.1948 22.5724 24.0951 4.4511 166.0399 29.4045 39.8989 6.3507 308.1051 21.6163 10.7317 3.7171 0.0270 10.2122 23.0791 17.7601 5.2563 10.9236 0.6689 24.5547 2.0800 148.3699 4.3315 30.8012 60.8819 12.9759 8.6117 11.7808 0.7201 10.8286 17.9095 58.9400 31.2773 1.6720 60.8924 14.7609 25.9330 8.5428 5.7146 516.5753 74.9604 84.0558 5.8976 233.7660 44.8943 12.1089 36.1888 36.5995 5.3209 29.9208 39.6677 13.6674 48.9361 33.4803 2.4014 29.3158 18.3617 37.7746 27.9167 29.9272 16.2907 34.2559 22.6776 16.8947 5.0152 14.4476 6.9836 23.0646 7.9812
temp: 298.150 k
press: 1.00000 atm
elementType: 8 8 8 8 7 6 6 6 6 6 6 6 6 6 6 6 6 6 6 6 6 6 6 1 1 1 1 1 1 1 1 1 1 1 1 1 1 1 1 1 1 1 1 1 1 1 1 1
symmnumber: 1
zpe: 1049079.9 jmol-1
zpe.correction: 0.399573 hartree
zpe.thermalcorrener: 0.423421 hartree
zpe.thermalcorrenthalpy: 0.424366 hartree
zpe.thermalcorrgfe: 0.345182 hartree
zpe.sumelectzpe: -1054.833707 hartree
zpe.sumelectthermal: -1054.809859 hartree
zpe.sumelectthermalent: -1054.808915 hartree
zpe.sumelectthermalfe: -1054.888099 hartree
dipole: 1.6736 -5.1862 2.9948
dipole: 6.2182
quadrupole: -125.8952 -139.0274 -135.6228
quadrupole: -1.6163 -1.0421 1.6430
quadrupole: 7.6199 -5.5123 -2.1076 -1.6163 -1.0421 1.6430
hfenergy: -1055.2332808 hartree
pointgroup: C01 [X(C18H25N1O4)]
dipole: 0.6664486 2.0843944 -1.0936775 debye
polarizability: 335.1296035|13.8421588|188.702312|2.1101182|-15.4593925|156.2159217 unknown
InChI: InChI=1S/C18H25NO4/c1-5-23-13-8-6-12(7-9-13)19-15(20)14-10-11-18(4,16(21)22)17(14,2)3/h6-9,14,19,21H,5,10-11H2,1-4H3
charge 0 multiplicity 1
48 atoms
O  -5.197579 1.96829 1.014167
O  -5.887162 -0.201316 1.400499
O  -0.281485 -2.05634 0.264559
O  6.090815 -0.277287 0.308599
N  0.523706 -0.099889 -0.748229
C  -2.648854 0.362788 0.198352
C  -4.153141 0.226973 -0.342467
C  -1.891241 -0.552825 -0.846878
C  -4.268641 -1.282361 -0.724406
C  -2.833721 -1.757898 -1.102662
C  -2.105915 1.810326 0.20253
C  -2.539002 -0.220451 1.633013
C  -4.428201 1.125949 -1.581537
C  -5.157378 0.582724 0.754546
C  -0.48966 -0.989376 -0.390313
C  1.921212 -0.165824 -0.466196
C  2.738344 0.893586 -0.933487
C  2.521992 -1.237813 0.252351
C  4.12948 0.90102 -0.699788
C  3.907818 -1.230442 0.485006
C  4.721646 -0.169997 0.015201
C  6.98031 0.800055 -0.165337
C  8.394728 0.430768 0.27395
H  -1.786083 0.039597 -1.77941
H  -4.983049 -1.412462 -1.556622
H  -4.666552 -1.856648 0.1283
H  -2.509007 -2.601904 -0.470299
H  -2.767463 -2.093378 -2.152534
H  -2.028621 2.231381 -0.817511
H  -2.765382 2.472586 0.789565
H  -1.100841 1.838268 0.663209
H  -3.096339 0.409263 2.350623
H  -2.92932 -1.249502 1.701947
H  -1.485241 -0.246406 1.960126
H  -4.325902 2.196479 -1.345091
H  -3.738622 0.872059 -2.405995
H  -5.456783 0.956805 -1.948891
H  0.224091 0.721806 -1.278691
H  -5.860405 2.131935 1.739641
H  2.287949 1.727721 -1.487693
H  1.896752 -2.056188 0.612669
H  4.727941 1.735849 -1.07515
H  4.38344 -2.048586 1.034561
H  6.909879 0.878527 -1.270382
H  6.660654 1.766071 0.278303
H  9.110072 1.206615 -0.054605
H  8.45071 0.344821 1.372448
H  8.698247 -0.534766 -0.16509
