program: Gaussian 09
title: 000246455
version: EM64L-G09RevD.01
frameworkgroup: C1[X(C22H26N2O2)]
method: RPBEPBE
basis: SDD
operation: Freq
keyword: #p
keyword: freq=noraman
keyword: PBEPBE/SDD
title: #p freq=noraman PBEPBE/SDD
converged: YES YES NO NO
title: Mulliken charges:
elementType: O O N N C C C C C C C C C C C C C C C C C C C C C C H H H H H H H H H H H H H H H H H H H H H H H H H H
charge: -0.258407 -0.260773 -0.110510 -0.047602 -0.404767 -0.329960 -0.325724 -0.297586 -0.668546 -0.670618 0.344328 0.479210 -0.399831 -0.377275 -0.404425 -0.323612 -0.393768 0.244284 0.371253 -0.374823 -0.365153 0.318197 -0.371547 -0.366760 -0.307844 -0.537301 0.223792 0.218913 0.206874 0.193642 0.206910 0.190819 0.229587 0.212555 0.208968 0.226264 0.209511 0.208980 0.227688 0.210099 0.252632 0.255062 0.227159 0.253944 0.214916 0.224024 0.249244 0.250893 0.242949 0.223510 0.224161 0.246462
chargesum: 0.00000
title: Mulliken charges with hydrogens summed into heavy atoms:
elementType: O O N N C C C C C C C C C C C C C C C C C C C C C C
charge: -0.258407 -0.260773 -0.110510 -0.047602 0.037939 0.070556 0.072005 0.144556 -0.023803 -0.023851 0.344328 0.479210 -0.147199 -0.122212 -0.177266 -0.069668 -0.178852 0.244284 0.371253 -0.150799 -0.115909 0.318197 -0.120654 -0.123811 -0.307844 0.156832
polarizability: 5.79699050e+02 3.12830691e+01 2.53710086e+02 6.40881125e+00 1.06258556e+01 1.51070286e+02
1716.lowfreq: -4.2170 -1.2828 -0.0019 0.0009 0.0020 5.4518 12.0938 19.1445 23.6434
frequency: 11.2688 19.0889 23.5282 30.3399 36.8341 48.7205 58.8670 64.1017 78.1131 88.7573 94.7595 124.5287 131.3316 144.6943 146.0194 169.4853 183.9786 199.3288 203.5671 225.4265 236.8664 264.8247 276.0537 283.1689 299.5842 325.3689 358.2211 363.4398 380.6071 390.0934 412.3975 414.8290 418.0222 442.4039 473.4360 494.4314 502.0687 512.0504 534.7155 558.3244 599.2003 627.0938 633.1635 649.7443 731.7032 732.3272 738.7651 754.3188 774.3626 789.3461 795.7800 798.1649 810.2898 814.9016 823.3254 832.1772 835.4328 840.6587 916.3404 917.7610 947.9735 960.6125 961.3723 963.7267 968.6701 983.2970 988.6362 990.4337 999.3057 1010.4788 1062.9746 1063.6583 1076.4229 1084.7818 1094.7244 1111.8219 1122.8574 1123.5139 1126.7912 1157.9700 1163.4472 1183.3141 1188.2533 1207.7910 1220.9446 1236.9481 1241.9800 1245.2894 1270.9313 1282.9081 1292.0146 1295.4760 1310.5636 1316.7905 1330.0776 1337.3794 1364.2167 1369.1904 1373.8060 1387.4051 1388.0678 1390.7395 1397.0904 1430.4322 1435.4706 1436.3325 1460.0331 1463.4389 1466.2953 1469.7006 1471.1215 1471.5903 1479.8301 1486.2002 1486.4750 1492.4110 1497.7376 1507.1625 1561.3882 1572.6340 1586.6938 1620.5169 1622.2203 2147.8910 2858.4583 2866.6631 2920.2708 2961.9729 2972.9155 2982.8729 2986.2604 3021.5123 3037.0665 3038.7658 3051.1575 3065.1490 3076.1272 3079.6484 3091.8087 3093.0098 3107.5523 3123.2649 3127.3721 3139.0557 3141.2879 3158.6964 3165.8402 3166.9756 3170.1673 3189.1830
redmass: 5.4605 3.3311 4.4562 4.2407 4.0561 3.5266 4.0956 4.3418 2.7850 2.1883 3.4649 4.4648 3.6344 5.8842 3.2531 2.0757 2.4866 1.9781 1.9832 1.4757 1.9073 2.7306 4.3279 2.5160 2.5141 3.3703 5.0299 5.0295 3.7264 4.3382 3.1524 4.8469 3.1536 2.9702 2.9104 3.7389 3.7220 2.9761 2.4392 6.4096 6.5018 7.1309 7.0907 5.2162 3.5377 3.5187 3.7251 5.7933 4.0376 2.2158 1.1289 1.5245 1.4297 1.2756 1.2902 2.5949 1.6559 2.2825 1.8571 1.4714 1.3874 1.3872 7.6634 1.4121 1.3634 7.0230 5.7849 2.2590 2.6612 2.4812 1.8078 2.4136 1.9075 2.1867 2.8412 1.2604 1.6734 1.4149 1.3776 1.3216 1.4122 1.3990 1.3456 2.2446 2.1767 1.6531 2.3388 2.6591 4.5425 1.1212 1.2216 1.2197 1.3301 1.4575 1.3895 2.0698 1.3360 1.4126 4.3286 1.2335 1.2546 1.4452 2.1752 3.7351 1.5973 2.0530 1.0607 1.0534 1.0499 1.0885 1.0628 1.0754 1.0552 1.0759 1.0879 1.0892 2.2481 2.4768 6.7820 6.2226 6.0424 6.2737 6.2131 12.6297 1.0719 1.0713 1.0700 1.0328 1.0564 1.0357 1.0357 1.0879 1.0891 1.0993 1.1041 1.0978 1.0982 1.0982 1.1004 1.1004 1.0873 1.0893 1.0995 1.0886 1.0873 1.0891 1.0944 1.0951 1.0962 1.0941
irintensity: 0.6297 0.3867 1.2557 0.3125 0.3022 0.6932 1.4859 0.3027 0.3665 1.1772 2.7098 4.5509 3.6730 3.9990 0.1326 1.9244 2.2659 0.2307 1.7354 0.7063 0.7139 0.8558 0.2614 1.0650 3.3993 8.3749 0.3240 0.4941 6.1184 3.3850 0.4439 4.0799 0.5913 2.3427 1.3436 1.7798 28.7514 18.1187 45.3998 59.9292 6.9048 3.4105 3.0469 0.6967 1.8319 7.6311 2.5834 4.2148 1.4683 5.3195 3.8415 13.8610 4.7004 3.1527 1.8417 51.8858 9.3635 78.3306 0.1293 25.3989 0.3450 1.2355 196.8503 2.6830 0.1846 88.5827 4.1460 7.0889 13.8085 2.6803 36.0642 35.1220 22.7872 3.0589 17.2454 0.1892 10.2007 4.9131 15.3997 5.4278 20.5917 526.4771 0.7816 44.2006 89.7228 20.7957 248.2017 206.2927 164.3936 0.4977 11.8863 23.9739 15.9550 2.1152 5.7399 7.5680 2.3090 15.6370 32.3404 21.4911 19.8503 1.8116 71.8573 19.9963 4.6820 4.8446 6.8698 14.6644 13.8559 29.7032 28.5702 50.3934 12.0988 12.6238 29.5721 5.8641 4.1267 278.8596 7.2124 8.1894 98.3880 97.9814 294.9052 63.1321 33.6459 199.0303 67.3558 98.4484 39.7006 29.8784 30.8610 23.4889 17.9413 10.0871 46.3133 42.6719 64.4508 65.3856 34.0337 55.8440 18.4399 16.3489 30.1875 4.5629 7.9840 14.6728 16.7354 11.1578 9.5537 4.7764
temp: 298.150 k
press: 1.00000 atm
elementType: 8 8 7 7 6 6 6 6 6 6 6 6 6 6 6 6 6 6 6 6 6 6 6 6 6 6 1 1 1 1 1 1 1 1 1 1 1 1 1 1 1 1 1 1 1 1 1 1 1 1 1 1
symmnumber: 1
zpe: 1123244.3 jmol-1
zpe.correction: 0.427821 hartree
zpe.thermalcorrener: 0.454673 hartree
zpe.thermalcorrenthalpy: 0.455617 hartree
zpe.thermalcorrgfe: 0.366447 hartree
zpe.sumelectzpe: -1111.916566 hartree
zpe.sumelectthermal: -1111.889715 hartree
zpe.sumelectthermalent: -1111.888770 hartree
zpe.sumelectthermalfe: -1111.977940 hartree
dipole: -1.1928 -1.4587 -1.0133
dipole: 2.1395
quadrupole: -97.3412 -157.2373 -160.4137
quadrupole: 5.3520 -1.3464 -2.4594
quadrupole: 40.9895 -18.9066 -22.0830 5.3520 -1.3464 -2.4594
hfenergy: -1112.3443871 hartree
pointgroup: C01 [X(C22H26N2O2)]
dipole: 0.4727808 -0.5421943 0.4370805 debye
polarizability: 579.2384162|-34.2808294|251.7788826|0.3175064|-18.6591523|153.4621238 unknown
InChI: InChI=1S/C22H26N2O2/c1-4-24(5-2)14-15-26-22-10-6-18(7-11-22)16-20(17-23)19-8-12-21(25-3)13-9-19/h6-13,16H,4-5,14-15H2,1-3H3
charge 0 multiplicity 1
52 atoms
O  3.790774 -1.170275 0.495206
O  -8.469599 -0.200859 0.239347
N  7.146056 0.366629 -0.084477
N  -1.968447 2.909642 -0.721758
C  6.145347 -0.676388 0.247848
C  7.51251 1.208014 1.088079
C  8.319371 -0.149111 -0.838381
C  4.730314 -0.115043 0.056444
C  7.990444 2.618338 0.693738
C  7.988757 -0.47729 -2.306667
C  2.422567 -0.909873 0.414072
C  -0.419532 -0.571099 0.330658
C  1.568717 -1.960199 0.841342
C  1.859364 0.305614 -0.05765
C  0.180144 -1.786994 0.795963
C  0.462733 0.466974 -0.0962
C  -1.87978 -0.509759 0.332589
C  -2.76981 0.502207 0.000453
C  -4.25143 0.33421 0.047742
C  -4.867556 -0.952765 0.08773
C  -5.10702 1.468494 0.049772
C  -7.094043 0.054881 0.173135
C  -6.260726 -1.093884 0.154196
C  -6.510169 1.343688 0.114388
C  -2.308471 1.808347 -0.393494
C  -9.372928 0.953663 0.24703
H  6.271181 -1.545374 -0.421426
H  6.251698 -1.056493 1.289831
H  6.612331 1.307331 1.723754
H  8.288284 0.706455 1.720306
H  9.099114 0.633505 -0.821039
H  8.762717 -1.048273 -0.34009
H  4.558262 0.1327 -1.008464
H  4.577585 0.796968 0.667753
H  8.911167 2.587905 0.083851
H  7.210702 3.132706 0.105484
H  8.208734 3.218032 1.596984
H  8.888599 -0.848119 -2.832107
H  7.622094 0.425469 -2.825424
H  7.209861 -1.257282 -2.388671
H  2.018419 -2.890941 1.199632
H  2.497671 1.126258 -0.397027
H  -0.46946 -2.606221 1.128428
H  0.062965 1.413849 -0.465261
H  -2.348223 -1.442551 0.675028
H  -4.257413 -1.860683 0.038589
H  -4.670433 2.472559 0.007969
H  -6.731133 -2.081495 0.176922
H  -7.126802 2.247185 0.118032
H  -9.191905 1.598753 1.128513
H  -9.268093 1.551236 -0.679126
H  -10.384606 0.526058 0.300951
