program: Gaussian 09
title: 000246559
version: EM64L-G09RevD.01
frameworkgroup: C1[X(C18H19NO4S)]
method: RPBEPBE
basis: SDD
operation: Freq
keyword: #p
keyword: freq=noraman
keyword: PBEPBE/SDD
title: #p freq=noraman PBEPBE/SDD
converged: YES YES NO NO
title: Mulliken charges:
elementType: S O O O O N C C C C C C C C C C C C C C C C C C H H H H H H H H H H H H H H H H H H H
charge: 0.180403 -0.286062 -0.430939 -0.212643 -0.299721 -0.403951 -0.110690 -0.713758 -0.802521 0.486634 0.204708 0.306505 -0.478384 0.466645 -0.387791 -0.373075 -0.219145 -0.221339 -0.385131 -0.367169 -0.237231 -0.225498 -0.228754 -0.232384 0.300713 0.281880 0.274596 0.268247 0.284237 0.348501 0.245323 0.222876 0.244959 0.235954 0.227082 0.226030 0.233328 0.271697 0.228752 0.227716 0.228645 0.230230 0.390524
chargesum: 0.00000
title: Mulliken charges with hydrogens summed into heavy atoms:
elementType: S O O O O N C C C C C C C C C C C C C C C C C C
charge: 0.180403 -0.286062 -0.040415 -0.212643 -0.299721 -0.055450 0.190023 -0.157282 -0.250037 0.486634 0.204708 0.306505 -0.010186 0.466645 -0.142832 -0.137121 0.007936 0.004691 -0.151802 -0.095472 -0.008479 0.002219 -0.000109 -0.002153
polarizability: 3.09123654e+02 9.78456377e+00 2.27938585e+02 3.33294385e+01 -8.66750513e+00 1.57097965e+02
1716.lowfreq: -3.7856 -0.0006 0.0010 0.0012 3.3706 6.6757 8.8520 16.6558 19.4045
frequency: 8.7357 16.5788 19.3967 27.4059 28.7047 38.3181 50.2684 52.4366 65.5236 77.6648 88.4196 119.4638 126.3907 155.1667 184.8450 229.1083 232.4028 255.0257 267.9992 299.9882 331.9668 338.4145 364.7658 403.0859 404.5351 410.6075 471.5019 482.1490 539.9482 553.3778 557.8682 585.6418 600.0328 615.9278 616.6456 618.0233 643.4063 651.5812 682.1553 697.1475 702.3252 705.1181 724.7298 754.6647 773.2915 778.3768 807.8875 816.3637 853.6391 859.5097 861.8804 893.9034 911.3371 928.5677 936.5607 958.1731 978.5927 982.1271 986.4362 989.9711 991.0747 996.5783 1001.8209 1026.3684 1027.4385 1029.5484 1072.3241 1079.6817 1091.3185 1117.8872 1132.8686 1160.5929 1172.7005 1173.7073 1188.2285 1189.5713 1204.8286 1221.5408 1222.8173 1238.9259 1241.3671 1245.0825 1300.7721 1304.7280 1327.5005 1330.9302 1337.1774 1351.1203 1385.5999 1385.9680 1428.5176 1441.1907 1442.6455 1459.8873 1467.0359 1477.0878 1483.9989 1485.1255 1594.2890 1594.7090 1613.7993 1615.0516 1648.0529 1679.1306 3018.9855 3027.8586 3037.4836 3077.6010 3097.4325 3109.0079 3111.6231 3120.0906 3121.2140 3124.2865 3128.1905 3136.3351 3140.2770 3147.8458 3151.2843 3164.3808 3164.9896 3528.7733 3563.9154
redmass: 6.0568 5.7657 4.8282 4.6174 4.4854 4.5020 7.3665 5.2191 7.3405 9.2308 5.7780 9.6662 6.3319 6.1383 3.9148 5.5066 3.8725 6.7651 6.4141 4.3822 2.3093 4.0823 3.1987 2.8098 2.8361 4.2834 3.7410 4.2603 3.8652 4.2640 4.1211 1.6865 1.9843 1.6063 6.2733 3.8861 4.0866 5.1501 5.1569 8.6382 1.6812 1.8934 5.1730 2.3331 2.2014 2.6422 4.0322 3.4826 1.2494 1.3617 3.2170 1.5885 2.2319 1.5026 1.4985 2.5492 1.3903 1.7578 2.1442 6.0583 5.3088 1.3253 1.3325 2.2771 2.2171 3.0126 1.5795 1.9684 1.5204 5.0650 1.1047 1.3315 1.0518 1.0541 1.1164 1.1233 1.7368 2.0906 2.8402 1.1576 1.4293 1.3144 1.3647 2.3427 1.2723 1.2565 1.1903 1.2612 8.4939 8.0287 1.1017 2.1653 2.1676 1.1434 1.1695 1.7660 2.3295 2.2807 6.0851 6.0885 6.1146 6.0677 9.4524 9.0501 1.0569 1.0574 1.0586 1.0870 1.1090 1.1059 1.1073 1.0866 1.0851 1.0880 1.0875 1.0922 1.0920 1.0965 1.0964 1.1017 1.1016 1.0643 1.0776
irintensity: 0.1320 0.0213 0.2085 0.1080 0.8065 0.3533 3.8187 2.0661 0.0943 4.1697 2.8392 0.8210 0.8063 1.6147 0.6873 8.2040 0.7017 0.0487 4.4754 7.1822 1.0400 3.5267 15.4696 0.0796 0.4070 7.2891 4.0155 23.3566 5.4404 20.7555 15.8142 92.6987 57.2955 110.4632 0.7381 22.5389 30.8022 13.9840 10.4219 11.3227 55.2502 56.0422 62.9718 52.2145 44.0714 2.6405 3.4060 9.0824 0.0667 2.4664 20.8030 18.2862 119.8750 17.8274 4.2399 69.3328 0.0776 44.7580 96.4678 0.1137 19.7995 0.2108 1.2734 5.6750 4.1888 15.1128 33.0686 112.0883 7.6542 69.1698 8.7840 115.7663 0.1459 0.0791 2.7414 6.2397 215.8555 4.4550 24.1122 10.4196 5.9498 33.5920 111.5662 27.5569 0.2669 1.9982 42.1403 29.0822 0.1693 0.7434 9.0198 7.1984 9.5084 11.7797 31.1050 448.6770 8.4920 30.0927 1.5721 1.7760 2.2461 0.5218 230.2048 201.9923 20.0186 13.3810 36.1470 5.9236 4.7916 1.7329 5.5205 5.2825 5.2452 0.4911 2.1372 16.0129 18.2619 38.6893 26.6899 25.5389 20.9753 36.2335 55.0254
temp: 298.150 k
press: 1.00000 atm
elementType: 16 8 8 8 8 7 6 6 6 6 6 6 6 6 6 6 6 6 6 6 6 6 6 6 1 1 1 1 1 1 1 1 1 1 1 1 1 1 1 1 1 1 1
symmnumber: 1
zpe: 879663.5 jmol-1
zpe.correction: 0.335046 hartree
zpe.thermalcorrener: 0.358568 hartree
zpe.thermalcorrenthalpy: 0.359512 hartree
zpe.thermalcorrgfe: 0.274920 hartree
zpe.sumelectzpe: -1449.294421 hartree
zpe.sumelectthermal: -1449.270899 hartree
zpe.sumelectthermalent: -1449.269954 hartree
zpe.sumelectthermalfe: -1449.354547 hartree
dipole: 1.9220 0.4398 1.5861
dipole: 2.5304
quadrupole: -131.3766 -129.8453 -154.2223
quadrupole: 3.5599 6.2383 1.9726
quadrupole: 7.1048 8.6361 -15.7409 3.5599 6.2383 1.9726
hfenergy: -1449.6294667 hartree
pointgroup: C01 [X(C18H19N1O4S1)]
dipole: 0.7658522 0.3763377 -0.51277 debye
polarizability: 310.1407918|18.735973|192.5955339|-26.5068607|36.9180166|191.4238782 unknown
InChI: InChI=1S/C18H19NO4S/c20-17(21)16(13-24-12-15-9-5-2-6-10-15)19-18(22)23-11-14-7-3-1-4-8-14/h1-10,16,19-20H,11-13H2
charge 0 multiplicity 1
43 atoms
S  -2.643183 1.066853 -1.274819
O  3.251181 -1.236347 -0.994404
O  -0.728283 -1.182356 -3.628112
O  -2.045617 -2.357761 -2.110085
O  1.625552 -1.266816 0.723824
N  1.075658 -0.869205 -1.524318
C  -0.365323 -0.717904 -1.292349
C  -0.777057 0.779559 -1.298859
C  -3.090645 0.15772 0.360226
C  -4.523688 0.46121 0.723764
C  -1.155996 -1.515807 -2.33435
C  1.946954 -1.131991 -0.487057
C  4.32824 -1.443961 0.036746
C  4.869085 -0.129327 0.555088
C  -5.566967 -0.408936 0.314482
C  -4.852795 1.622355 1.470614
C  -6.910596 -0.127587 0.649241
C  -6.194613 1.904437 1.807592
C  5.988286 0.482444 -0.064644
C  4.264656 0.504548 1.672106
C  -7.228272 1.029468 1.397692
C  6.495269 1.709368 0.418657
C  4.770556 1.731176 2.15584
C  5.8868 2.336018 1.531221
H  -0.584587 -1.160216 -0.307114
H  -0.315017 1.283854 -0.433333
H  -0.436617 1.263818 -2.22953
H  -2.382744 0.522903 1.123667
H  -2.938662 -0.91943 0.185729
H  1.444558 -0.758821 -2.470674
H  3.901068 -2.058684 0.847428
H  5.089586 -2.01225 -0.520023
H  -5.321849 -1.305846 -0.267068
H  -4.054128 2.305328 1.784485
H  -7.706377 -0.809423 0.329053
H  -6.434645 2.802279 2.388203
H  6.461852 -0.003102 -0.927026
H  3.394422 0.035008 2.144447
H  -8.269786 1.247186 1.659759
H  7.361939 2.172815 -0.065822
H  4.298999 2.212807 3.01972
H  6.281031 3.286023 1.909531
H  -1.258646 -1.686007 -4.302321
