program: Gaussian 09
title: 000246442
version: EM64L-G09RevD.01
frameworkgroup: C1[X(C17H13NO3)]
method: RPBEPBE
basis: SDD
operation: Freq
keyword: #p
keyword: freq=noraman
keyword: PBEPBE/SDD
title: #p freq=noraman PBEPBE/SDD
converged: YES YES NO NO
title: Mulliken charges:
elementType: O O O N C C C C C C C C C C C C C C C C C H H H H H H H H H H H H H
charge: -0.280968 -0.270466 -0.259478 -0.129529 0.567455 0.216602 0.176931 -0.426035 0.157619 -0.479461 -0.484922 -0.432003 0.103873 -0.348844 0.284652 -0.202492 -0.368219 -0.343804 -0.223550 -0.227467 -0.230789 0.250197 0.249859 0.251497 0.251812 0.236052 0.252023 0.238926 0.238467 0.272518 0.266269 0.231474 0.230255 0.231548
chargesum: 0.00000
title: Mulliken charges with hydrogens summed into heavy atoms:
elementType: O O O N C C C C C C C C C C C C C C C C C
charge: -0.280968 -0.270466 -0.259478 -0.129529 0.567455 0.216602 0.176931 0.074021 0.157619 -0.227965 -0.233109 -0.195951 0.103873 -0.096821 0.284652 0.274901 -0.095702 -0.077535 0.007924 0.002787 0.000759
polarizability: 5.20594353e+02 -1.76498196e+01 1.97492517e+02 -4.50187668e-02 4.20490350e-02 8.42435467e+01
1716.lowfreq: -51.5917 -9.1244 -3.8608 -1.9323 -0.0006 0.0006 0.0006 26.8403 32.8539
frequency: -51.5866 26.8321 32.8532 51.4767 63.9575 101.5988 113.4099 157.9495 219.8034 221.7019 226.8889 245.4800 262.3437 361.8625 364.3744 403.0090 416.4688 422.2638 447.0144 451.9157 510.3905 549.0808 606.9016 613.5537 615.7325 662.3610 675.5600 680.3717 696.8656 703.6672 717.6894 763.1248 782.1228 790.5075 810.5726 839.6664 844.1079 848.5224 860.3088 871.0186 902.6038 923.8789 933.2823 942.2061 945.1338 980.5547 988.3235 990.9206 992.3029 997.6239 1004.7387 1032.1400 1057.3158 1064.5581 1081.8445 1116.6927 1119.5415 1143.9238 1144.5359 1173.7014 1185.1440 1203.3637 1243.5687 1271.7787 1276.4724 1304.1176 1320.7865 1343.0317 1366.7833 1387.0258 1390.5511 1437.5982 1450.9930 1463.6218 1470.8101 1480.9475 1488.5918 1534.5754 1585.5304 1599.0010 1611.2638 1623.4547 1667.9463 2994.5635 3012.8215 3056.3038 3090.6094 3127.2495 3129.6366 3141.7707 3143.8783 3155.8232 3167.0788 3174.5685 3182.2433 3206.6978
redmass: 2.3253 5.9193 4.9094 5.9142 5.2795 5.7802 6.2422 5.4293 6.5868 5.5990 3.3882 5.8241 6.5023 7.2634 4.7485 2.8338 4.9984 3.1288 6.9661 3.1082 2.9518 6.8556 7.7809 6.4729 3.9348 5.5134 7.7244 7.7585 1.8106 6.9054 3.1967 7.0163 1.8765 6.2872 1.3449 9.6281 1.5955 10.1928 1.2463 4.9247 1.4124 8.1675 3.8093 1.4103 1.4190 4.8948 6.2165 1.5562 1.4955 6.8248 1.3264 1.9958 4.0238 1.4583 1.6451 2.6434 1.0368 1.0902 1.6506 1.0571 1.1148 1.8918 2.4057 1.5104 2.9415 1.6400 1.4079 2.5847 1.3098 8.7486 2.5786 2.3319 3.5537 1.2163 2.2309 1.8699 1.5370 7.3503 6.2989 7.7759 6.0593 8.2114 9.1991 1.0567 1.0534 1.1093 1.1189 1.0885 1.0853 1.0892 1.0894 1.0938 1.0959 1.1000 1.0957 1.0909
irintensity: 14.2682 0.3264 0.0024 0.1963 0.0022 2.5748 0.1985 1.0113 0.7590 0.0372 5.7435 0.4358 1.7830 11.6650 0.2977 0.0010 3.0904 2.3012 5.8592 2.0688 8.3401 12.7361 4.3553 0.2084 8.7765 22.4460 4.8191 7.7496 55.2284 1.3441 6.1462 6.2419 46.3796 19.6955 25.8679 19.3066 14.8152 16.9333 0.0069 16.8822 45.3389 32.4331 27.5661 3.8149 7.0445 155.5264 0.8073 0.2811 0.3129 58.1415 0.5584 20.2032 16.4127 4.3237 8.9625 28.8134 0.0302 0.4785 9.1253 0.0237 10.0329 99.2472 147.3607 21.9670 172.0232 11.4466 11.6870 18.4683 5.9519 0.3945 18.1199 19.0799 82.5022 23.5181 149.5579 86.3394 73.5364 83.1587 0.0152 10.6636 1.0543 12.8310 6.6571 13.8642 168.0910 11.8769 32.4655 6.1699 0.7836 13.2496 9.1001 29.6157 12.9678 21.1225 10.5236 2.5011
temp: 298.150 k
press: 1.00000 atm
elementType: 8 8 8 7 6 6 6 6 6 6 6 6 6 6 6 6 6 6 6 6 6 1 1 1 1 1 1 1 1 1 1 1 1 1
symmnumber: 1
zpe: 675048.8 jmol-1
zpe.correction: 0.257113 hartree
zpe.thermalcorrener: 0.273159 hartree
zpe.thermalcorrenthalpy: 0.274103 hartree
zpe.thermalcorrgfe: 0.211655 hartree
zpe.sumelectzpe: -934.528908 hartree
zpe.sumelectthermal: -934.512862 hartree
zpe.sumelectthermalent: -934.511918 hartree
zpe.sumelectthermalfe: -934.574366 hartree
dipole: -0.5730 -1.0585 0.0253
dipole: 1.2039
quadrupole: -94.4646 -112.7342 -125.9917
quadrupole: 4.7335 -0.1183 0.0119
quadrupole: 16.5989 -1.6707 -14.9282 4.7335 -0.1183 0.0119
hfenergy: -934.7860205 hartree
pointgroup: C01 [X(C17H13N1O3)]
dipole: 0.2308471 0.4098239 0.0557587 debye
polarizability: 519.9632182|-20.6979985|196.264097|-10.0582891|13.9202891|86.1031015 unknown
InChI: InChI=1S/C17H13NO3/c1-2-4-13(5-3-1)17-18-14(10-19-17)8-12-6-7-15-16(9-12)21-11-20-15/h1-9H,10-11H2
charge 0 multiplicity 1
34 atoms
O  -1.890118 1.469456 0.171546
O  4.798992 1.785071 0.086237
O  6.285223 -0.088212 -0.163368
N  -1.708227 -0.829008 -0.117118
C  2.135268 -0.882199 -0.190159
C  -0.372513 -0.341636 -0.079996
C  4.060914 0.580748 -0.044434
C  -0.424994 1.18094 0.109881
C  4.936283 -0.516528 -0.190449
C  0.704994 -1.185208 -0.202976
C  2.676223 0.442948 -0.039527
C  3.042527 -1.978604 -0.33582
C  -2.523269 0.203973 0.02483
C  4.449476 -1.817958 -0.33921
C  -3.984649 0.184287 0.048457
C  6.230686 1.387823 0.023944
C  -4.667528 -1.056514 -0.087476
C  -4.727262 1.3864 0.205473
C  -6.075115 -1.089673 -0.065592
C  -6.136735 1.343791 0.225942
C  -6.814513 0.108942 0.091107
H  0.025595 1.528558 1.057301
H  -0.006423 1.752447 -0.73846
H  0.44018 -2.242433 -0.328793
H  2.046796 1.325384 0.075929
H  2.62824 -2.986357 -0.44969
H  5.123866 -2.670167 -0.452418
H  6.702802 1.876749 -0.845426
H  6.718253 1.645991 0.979974
H  -4.077412 -1.970464 -0.207585
H  -4.192785 2.335445 0.309098
H  -6.598582 -2.0462 -0.170296
H  -6.707169 2.271138 0.346847
H  -7.909722 0.079567 0.107725
