program: Gaussian 09
title: 000246441
version: EM64L-G09RevD.01
frameworkgroup: C1[X(C16H22O8)]
method: RPBEPBE
basis: SDD
operation: Freq
keyword: #pfreq=noraman
keyword: PBEPBE/SDD
title: #p freq=noraman PBEPBE/SDD
converged: YES YES NO NO
title: Mulliken charges:
elementType: O O O O O O O O C C C C C C C C C C C C C C C C H H H H H H H H H H H H H H H H H H H H H H
charge: -0.267399 -0.272625 -0.272627 -0.267393 -0.237919 -0.230544 -0.230545 -0.237902 -0.217690 -0.217684 -0.195945 -0.182141 -0.182129 -0.195970 -0.559375 -0.559352 0.188884 0.182927 0.182941 0.188860 -0.503921 -0.506523 -0.506528 -0.503919 0.320607 0.320615 0.269617 0.263706 0.263715 0.269626 0.248372 0.257406 0.257397 0.248368 0.238972 0.243486 0.234649 0.227610 0.244589 0.253239 0.227615 0.244586 0.253229 0.238977 0.243487 0.234649
chargesum: 0.00000
title: Mulliken charges with hydrogens summed into heavy atoms:
elementType: O O O O O O O O C C C C C C C C C C C C C C C C
charge: -0.267399 -0.272625 -0.272627 -0.267393 -0.237919 -0.230544 -0.230545 -0.237902 0.102917 0.102931 0.073672 0.081565 0.081586 0.073656 -0.053598 -0.053587 0.188884 0.182927 0.182941 0.188860 0.213187 0.218916 0.218902 0.213194
polarizability: 2.46429289e+02 -4.18563233e+00 1.87725345e+02 -2.61579993e-03 -4.65717417e-04 1.44676317e+02
1716.lowfreq: -11.0598 -10.2755 -0.0005 -0.0002 0.0006 5.7972 11.7537 20.0546 21.8979
frequency: 11.2480 19.5664 21.7747 36.0586 37.9592 46.0234 50.9708 58.9251 68.5566 80.5041 82.5622 92.8097 93.0437 107.3821 116.6943 142.5805 152.8475 168.4387 194.9005 210.4846 213.8816 214.9085 232.5215 234.6141 270.0503 271.9180 293.6669 306.8294 326.5968 333.3946 414.0196 417.2167 426.7616 496.3961 532.5262 559.6677 584.8295 651.3081 669.6686 686.3152 692.5924 696.6940 720.9969 724.9467 742.9940 810.3197 830.5147 863.0086 867.1377 872.3430 920.6492 930.7018 932.8483 967.2184 976.1185 981.1580 993.1072 998.1352 1031.9409 1061.4906 1070.0012 1088.6744 1096.3672 1106.8332 1112.2379 1113.5392 1113.5492 1115.5761 1125.8219 1128.4857 1135.8638 1136.9444 1148.8003 1149.0018 1150.7108 1150.8406 1160.6930 1190.0185 1226.7359 1231.0396 1247.0212 1254.4435 1255.4877 1275.7203 1280.6676 1287.0124 1305.7528 1308.2806 1343.8034 1350.2896 1362.6224 1363.4900 1419.7468 1419.8154 1422.3843 1422.4496 1452.2866 1452.2976 1452.8871 1452.8917 1463.2618 1463.2925 1464.8986 1464.9194 1477.2146 1479.1942 1638.3216 1638.7842 1645.2073 1646.6352 2996.7861 2998.2625 3004.3400 3004.4162 3005.6975 3005.9006 3006.6930 3010.4001 3017.6500 3018.6525 3022.1886 3037.1686 3091.7340 3091.8978 3106.1700 3106.1846 3111.3955 3111.4028 3147.5366 3147.5493 3149.4858 3149.4998
redmass: 5.3446 5.2570 5.7625 4.0353 3.9233 3.9266 3.5507 4.3748 3.3150 1.2273 1.4151 1.1360 1.1593 3.5254 3.6712 4.1959 4.0556 4.1025 3.9376 4.4298 4.5868 5.2545 3.4326 4.1567 4.1642 5.3524 4.4887 5.1034 4.4346 4.7723 4.8259 3.9170 4.4154 3.9959 3.6111 3.9823 4.0057 5.4513 6.2561 5.0111 4.5926 5.6472 6.5772 5.9461 5.8917 2.3963 5.7171 6.2480 7.4694 6.1017 2.4543 4.8756 2.5061 2.5711 2.3228 4.2259 3.8920 2.6340 4.3708 3.3617 3.6874 2.9163 3.1549 1.5023 1.4038 1.2681 1.2860 1.3963 2.5713 2.4859 2.9549 3.3941 1.4573 1.4472 1.4514 1.4593 2.5891 1.5928 1.4093 1.4801 1.4486 1.3246 1.3328 1.2440 1.2443 1.2928 1.2249 1.3380 1.6963 1.7322 1.6381 1.5861 1.1951 1.1944 1.1909 1.1925 1.0506 1.0506 1.0507 1.0507 1.0506 1.0504 1.0508 1.0508 1.0875 1.0936 9.6264 9.6949 9.4298 9.5972 1.0831 1.0835 1.0297 1.0298 1.0359 1.0293 1.0754 1.0827 1.0634 1.0637 1.0835 1.0847 1.1041 1.1035 1.1045 1.1045 1.1049 1.1049 1.1051 1.1051 1.1048 1.1048
irintensity: 0.2721 0.8853 0.0019 5.2748 2.1014 0.4487 0.3386 0.3857 0.0762 0.1080 0.0141 0.1575 0.5638 1.3535 0.0418 1.7832 1.5240 0.9932 7.7156 0.2373 3.6549 13.4395 9.0127 2.7311 10.0826 9.6566 66.0652 0.1231 13.2256 0.0873 0.3378 9.6641 3.7199 0.0251 2.1030 0.0005 1.6276 6.3196 6.3676 18.0396 4.3058 0.1717 1.3227 1.3229 21.4707 1.4477 0.6939 5.2481 25.6178 3.0898 21.0626 0.0225 22.1951 2.1589 2.1335 64.1590 0.0064 1.0981 25.2573 0.0453 86.1540 88.1416 0.2605 6.1862 48.3717 0.1582 0.5900 0.1339 6.7591 253.7166 550.3699 20.7032 0.8678 12.1753 27.2868 0.8688 13.5036 106.7231 7.7405 55.7190 0.1189 92.1659 0.3125 5.5315 1.8855 99.1995 4.4582 0.9830 87.3971 11.7153 17.6046 0.6059 54.0355 2.9902 35.5662 5.1832 2.0613 0.3445 28.8636 25.1294 16.7398 10.8924 5.5746 12.0862 4.2528 23.9913 114.0013 122.4482 183.1095 236.1270 3.9264 5.7876 66.6811 0.8469 64.5725 0.4425 5.6661 10.8281 1.8452 19.7190 6.2947 13.3301 14.4770 21.8913 14.3650 38.1537 13.2947 29.0897 14.6712 16.7178 15.7072 16.6197
temp: 298.150 k
press: 1.00000 atm
elementType: 8 8 8 8 8 8 8 8 6 6 6 6 6 6 6 6 6 6 6 6 6 6 6 6 1 1 1 1 1 1 1 1 1 1 1 1 1 1 1 1 1 1 1 1 1 1
symmnumber: 1
zpe: 957904.7 jmol-1
zpe.correction: 0.364847 hartree
zpe.thermalcorrener: 0.391471 hartree
zpe.thermalcorrenthalpy: 0.392415 hartree
zpe.thermalcorrgfe: 0.302372 hartree
zpe.sumelectzpe: -1222.855294 hartree
zpe.sumelectthermal: -1222.828670 hartree
zpe.sumelectthermalent: -1222.827726 hartree
zpe.sumelectthermalfe: -1222.917769 hartree
dipole: 0.0001 0.0004 -4.3858
dipole: 4.3858
quadrupole: -103.8851 -140.3749 -150.2729
quadrupole: -10.0910 -0.0023 -0.0025
quadrupole: 27.6259 -8.8640 -18.7619 -10.0910 -0.0023 -0.0025
hfenergy: -1223.2201409 hartree
pointgroup: C01 [X(C16H22O8)]
dipole: -0.0006273 -0.0004701 1.7255217 debye
polarizability: 246.5486949|3.2395495|187.6059218|0.0414348|0.0080479|144.6763345 unknown
InChI: InChI=1S/C16H22O8/c1-21-13(17)7-5-8(14(18)22-2)12-10(16(20)24-4)6-9(11(7)12)15(19)23-3/h7-12H,5-6H2,1-4H3
charge 0 multiplicity 1
46 atoms
O  -3.534619 -2.235898 0.606706
O  -3.216578 2.073831 0.570125
O  3.215676 -2.074424 0.57205
O  3.533828 2.2362 0.609912
O  -3.374537 -0.816136 -1.230465
O  -2.016354 3.143057 -1.120036
O  2.016911 -3.14217 -1.120086
O  3.375244 0.816613 -1.22752
C  -0.766269 0.171165 -0.30965
C  0.766194 -0.170658 -0.309203
C  -1.482961 -1.024563 0.366159
C  -0.88443 1.560936 0.410193
C  0.883828 -1.560787 0.410042
C  1.482424 1.02474 0.367674
C  -0.495452 -2.219456 0.174929
C  0.495024 2.21973 0.176448
C  -2.867244 -1.305929 -0.19549
C  -2.048159 2.363644 -0.141432
C  2.047972 -2.363223 -0.141087
C  2.867057 1.306404 -0.192981
C  -4.890895 -2.62442 0.148388
C  -4.46582 2.65276 0.015992
C  4.465313 -2.653502 0.018964
C  4.89049 2.624736 0.152744
H  -1.133259 0.266803 -1.34758
H  1.13391 -0.265817 -1.346919
H  -1.600015 -0.846637 1.452994
H  -1.055528 1.395692 1.490727
H  1.054087 -1.396073 1.49079
H  1.598823 0.846239 1.454489
H  -0.705178 -3.051145 0.867704
H  -0.54335 -2.611789 -0.857563
H  0.543644 2.612663 -0.855782
H  0.70426 3.051024 0.869844
H  -5.556291 -1.74459 0.142295
H  -4.844464 -3.049474 -0.868135
H  -5.229753 -3.372869 0.878061
H  -5.236704 2.434149 0.768206
H  -4.351263 3.738505 -0.137937
H  -4.698936 2.165497 -0.945459
H  5.235465 -2.435523 0.77211
H  4.350554 -3.739135 -0.135614
H  4.699622 -2.165857 -0.942002
H  5.555861 1.744885 0.147071
H  4.844892 3.049926 -0.86376
H  5.228782 3.373077 0.88279
