program: Gaussian 09
title: 000246417
version: EM64L-G09RevD.01
frameworkgroup: C1[X(C11H15Cl3NOPS)]
method: RPBEPBE
basis: SDD
operation: Freq
keyword: #p
keyword: freq=noraman
keyword: PBEPBE/SDD
title: #p freq=noraman PBEPBE/SDD
converged: YES YES NO NO
title: Mulliken charges:
elementType: Cl Cl Cl S P O N C C C C C C C C C C C H H H H H H H H H H H H H H H
charge: -0.050463 -0.046397 -0.035117 0.034614 0.977786 -0.599571 -0.502643 -0.317182 -0.284965 -0.891405 -0.561273 -0.575550 -0.283872 -0.181276 -0.186708 -0.202450 -0.200823 -0.102232 0.236759 0.294290 0.253703 0.251426 0.280179 0.263677 0.292036 0.290102 0.254252 0.272931 0.271919 0.258509 0.260683 0.265163 0.263896
chargesum: 0.00000
title: Mulliken charges with hydrogens summed into heavy atoms:
elementType: Cl Cl Cl S P O N C C C C C C C C C C C
charge: -0.050463 -0.046397 -0.035117 0.034614 0.977786 -0.599571 -0.502643 0.213867 0.220164 -0.055513 -0.016918 -0.030700 -0.283872 0.077233 0.073975 0.062713 0.063073 -0.102232
polarizability: 2.60745266e+02 2.04314022e+01 1.72976463e+02 1.12211118e+01 1.00560025e+01 1.88394391e+02
1716.lowfreq: -9.4011 -4.2474 -0.0015 0.0019 0.0020 6.5336 15.8276 22.6299 35.2643
frequency: 15.2314 22.5056 35.2548 38.4545 54.8402 58.1024 61.6623 94.9727 98.1341 104.5931 138.9150 163.6700 195.9275 203.2115 207.4470 210.3710 219.3605 225.1063 239.4524 275.1789 287.7179 320.7029 326.4574 344.8382 363.7906 412.8256 422.3879 473.5093 490.3887 508.8984 618.6249 619.7038 678.7668 692.6677 701.3882 715.8052 716.1807 772.1249 781.2173 829.0367 832.0244 920.6614 938.8624 945.7739 954.4390 968.9251 991.4679 997.5598 1026.4523 1035.7262 1045.6725 1055.7774 1063.0758 1071.8876 1097.2535 1114.7881 1178.1017 1196.9964 1231.8253 1252.9158 1256.1530 1280.3628 1288.1089 1329.3273 1333.3919 1349.3415 1350.6314 1361.7547 1380.2740 1427.4885 1439.3746 1451.0742 1452.6780 1456.7426 1466.7068 1478.0256 1569.0008 1570.6728 3011.0655 3017.5928 3019.1313 3053.0668 3063.4057 3077.5674 3084.8011 3140.0208 3142.3213 3143.1381 3147.8882 3148.9548 3154.2020 3172.4769 3176.2887
redmass: 10.7091 15.8628 15.5093 8.0198 4.3640 7.5769 7.6133 2.5293 2.2897 5.5117 5.7418 3.7111 1.6381 9.2130 7.5545 2.3534 2.6790 6.0417 6.8856 4.3398 6.5695 14.1543 4.8883 4.7088 4.5493 2.9534 6.0205 6.3363 3.6388 6.7901 5.2711 6.8626 6.6581 5.5329 4.1546 6.5870 4.8146 1.1711 1.1840 1.3620 1.3090 1.5024 1.4216 2.5023 1.3271 1.3575 4.8517 1.4956 3.8426 2.4610 4.2551 2.0741 6.2768 2.0368 1.3731 1.6552 1.1179 2.2426 1.6169 1.1704 1.1547 1.2439 1.1466 1.2078 1.1624 1.3545 3.3200 1.2363 4.0950 1.0478 1.0528 1.8227 1.1824 1.1011 1.0835 1.0729 7.8066 6.3092 1.0624 1.0334 1.0588 1.0564 1.0567 1.1008 1.1048 1.1027 1.1121 1.1017 1.0894 1.1114 1.0888 1.0962 1.0976
irintensity: 0.1217 0.0031 1.0473 1.0625 0.6266 2.3199 1.7967 1.2870 1.2124 1.7954 1.5887 1.5279 3.8292 0.4497 0.2712 2.4555 3.1703 0.3044 12.9165 16.3714 10.7585 0.6637 1.0331 13.0750 9.1198 1.5434 124.2427 8.5748 18.5778 15.9445 22.5267 3.6812 24.8176 83.1101 0.3402 15.0954 92.6757 2.0623 16.3860 39.5539 29.0374 16.5527 104.3495 48.5969 1.8956 0.3324 52.3392 9.0657 56.0107 13.6121 14.1911 34.4727 9.2741 45.6746 6.9853 48.9032 1.0402 46.3071 9.6764 10.5955 8.3632 0.7393 4.0755 14.4729 19.5775 1.0537 0.6785 1.8324 7.4869 10.7254 8.5211 58.1182 29.2341 1.5419 30.6195 11.6365 0.9743 18.6303 7.6807 1.6193 11.9788 20.6453 16.7594 5.0528 1.0174 2.6257 7.0358 2.8180 1.9912 12.6554 2.3776 3.8772 0.4934
temp: 298.150 k
press: 1.00000 atm
elementType: 17 17 17 16 15 8 7 6 6 6 6 6 6 6 6 6 6 6 1 1 1 1 1 1 1 1 1 1 1 1 1 1 1
symmnumber: 1
zpe: 636728.2 jmol-1
zpe.correction: 0.242517 hartree
zpe.thermalcorrener: 0.264169 hartree
zpe.thermalcorrenthalpy: 0.265113 hartree
zpe.thermalcorrgfe: 0.187529 hartree
zpe.sumelectzpe: -2676.224361 hartree
zpe.sumelectthermal: -2676.202709 hartree
zpe.sumelectthermalent: -2676.201765 hartree
zpe.sumelectthermalfe: -2676.279349 hartree
dipole: 2.7934 1.6186 -2.0960
dipole: 3.8492
quadrupole: -166.8866 -159.6631 -137.3447
quadrupole: -14.3032 -1.8770 -2.4451
quadrupole: -12.2552 -5.0317 17.2868 -14.3032 -1.8770 -2.4451
hfenergy: -2676.4668776 hartree
pointgroup: C01 [X(C11H15Cl3N1O1P1S1)]
dipole: -0.4464914 0.7418253 -1.2424808 debye
polarizability: 214.7139429|6.3941124|190.401441|49.3660219|12.0513786|217.0007367 unknown
InChI: InChI=1S/C6H4ClS.C5H11Cl2NOP/c7-5-1-3-6(8)4-2-5;1-10(9)8(4-2-6)5-3-7/h1-4H;2-5H2,1H3
charge 0 multiplicity 1
33 atoms
Cl 2.894487 -3.413351 2.202662
Cl 1.927076 0.04946 -3.814605
Cl -3.96784 -1.315026 -3.105287
S  -0.963623 0.918673 2.170477
P  1.229655 1.431917 1.351531
O  2.183024 1.678441 2.614333
N  1.819278 0.1356 0.326882
C  2.647153 -0.912348 0.974384
C  1.38793 -0.081747 -1.071467
C  0.940683 2.891758 0.224762
C  1.774439 -2.030732 1.57051
C  2.473429 0.414019 -2.043389
C  -1.779101 0.293278 0.646174
C  -1.853626 -1.102273 0.406897
C  -2.405281 1.19148 -0.255589
C  -2.521045 -1.599353 -0.735288
C  -3.070974 0.707342 -1.403999
C  -3.111963 -0.683879 -1.629125
H  3.335344 -1.335747 0.22064
H  3.25525 -0.446955 1.769377
H  1.198965 -1.157576 -1.245057
H  0.435121 0.434627 -1.278133
H  1.909571 3.233312 -0.173169
H  0.253439 2.635586 -0.595344
H  0.489797 3.686529 0.838734
H  1.194589 -1.685287 2.438834
H  1.119925 -2.499928 0.819926
H  2.620537 1.502313 -1.989718
H  3.430644 -0.110591 -1.908323
H  -1.406901 -1.799284 1.122669
H  -2.38877 2.266898 -0.050106
H  -2.585483 -2.67556 -0.919717
H  -3.556026 1.397107 -2.100577
