program: Gaussian 09
title: 000246409
version: EM64L-G09RevD.01
frameworkgroup: C1[X(C15H21NO5)]
method: RPBEPBE
basis: SDD
operation: Freq
keyword: #p
keyword: freq=noraman
keyword: PBEPBE/SDD
title: #p freq=noraman PBEPBE/SDD
converged: YES YES NO NO
title: Mulliken charges:
elementType: O O O O O N C C C C C C C C C C C C C C C H H H H H H H H H H H H H H H H H H H H H
charge: -0.314290 -0.266817 -0.251963 -0.215743 -0.224191 -0.441622 -0.278983 0.279282 0.220967 0.286064 0.189711 -0.345086 -0.328963 -0.258262 -0.277242 -0.277485 -0.265092 -0.255972 -0.672696 -0.658592 -0.661855 0.279501 0.365431 0.255644 0.228061 0.218115 0.220341 0.230195 0.200059 0.224893 0.235307 0.238786 0.228337 0.242047 0.236007 0.213485 0.216097 0.256159 0.227480 0.221034 0.230266 0.251587
chargesum: 0.00000
title: Mulliken charges with hydrogens summed into heavy atoms:
elementType: O O O O O N C C C C C C C C C C C C C C C
charge: -0.314290 -0.266817 -0.251963 -0.215743 -0.224191 -0.076191 0.000518 0.279282 0.220967 0.286064 0.189711 -0.089442 -0.100902 -0.040147 -0.056901 0.152768 0.195107 0.211151 0.018843 0.041143 0.041031
polarizability: 2.30317604e+02 -2.05968346e+00 2.05414060e+02 -6.83692789e-01 -2.57725798e+01 1.38016978e+02
1716.lowfreq: -25.0589 -6.9671 -3.9458 -0.0008 -0.0007 -0.0006 6.5528 25.8502 28.2101
frequency: -23.8284 25.7835 27.9136 35.3055 44.6881 55.6076 61.9090 73.5318 85.2632 97.2242 112.0581 133.6070 157.6374 169.9983 180.9873 196.0629 205.9003 221.9456 247.5133 272.9352 292.4933 297.7756 316.8432 332.1797 364.4406 419.2559 438.0944 450.8026 463.3621 520.8472 554.8750 561.2152 573.4423 583.6031 593.1904 653.3285 703.5262 725.0028 734.7135 735.0018 745.9493 789.2299 803.8575 809.1495 812.2562 819.8489 828.6411 856.2360 883.0677 889.7629 895.9475 942.2726 950.4270 1007.6178 1013.7206 1025.0201 1047.6115 1087.3388 1087.9129 1096.2589 1098.0643 1101.0602 1149.9034 1154.1027 1155.5727 1159.2907 1171.3132 1182.6998 1193.5975 1249.6893 1273.7745 1275.0240 1275.9222 1278.0070 1313.1071 1332.1247 1351.8833 1356.8341 1358.4195 1390.5120 1392.1695 1393.7753 1401.0389 1442.9729 1454.9131 1456.6952 1459.4899 1461.5525 1461.8393 1463.4378 1479.2240 1482.5591 1485.2325 1491.8567 1522.1603 1592.5396 1616.4076 1640.6594 1655.5446 2987.2796 2988.1531 2991.8860 2993.9589 2995.4711 3029.8429 3034.1806 3073.4527 3086.2371 3088.7350 3090.7134 3094.8692 3097.1987 3106.3517 3120.7707 3123.7787 3127.8457 3142.0605 3153.3345 3167.8814 3527.0450
redmass: 3.1550 4.1000 4.2527 3.5374 3.5223 4.5906 4.6907 4.2864 4.3750 3.2025 4.0873 4.2737 2.2187 3.5910 1.5337 1.4302 2.0239 1.8001 3.6783 2.7289 2.7742 3.1543 3.9644 5.2648 4.1514 3.6286 3.6252 3.4380 3.7932 4.7911 3.5291 3.3439 2.7255 2.1322 4.4417 4.8907 3.9407 4.1720 4.6918 1.2488 3.7709 3.2694 1.4202 1.1629 1.7530 2.2436 1.4406 3.8086 4.9054 2.7987 1.4432 3.0202 1.3325 2.6812 2.9667 3.9076 2.0943 2.1866 3.2616 2.3018 2.4223 2.5711 2.4036 1.8065 1.8046 1.7618 1.1625 2.1478 3.0399 1.4655 1.2599 1.1807 1.3900 1.1205 1.3901 1.6820 1.2768 1.3058 1.2976 1.2306 1.2291 1.2312 4.1141 2.6598 1.1311 1.6480 1.0905 1.0430 1.0688 1.0484 1.0578 1.0527 1.0518 1.0783 3.3625 6.0696 6.7740 8.4513 9.3052 1.0589 1.0824 1.0434 1.0363 1.0361 1.0595 1.0600 1.0988 1.0973 1.0974 1.0974 1.1033 1.1029 1.1018 1.1059 1.1066 1.0846 1.0890 1.0939 1.1000 1.0764
irintensity: 0.6620 2.1835 0.1182 0.6214 1.7159 0.8190 1.0360 1.8012 0.1527 0.2035 0.3364 1.6616 0.1067 0.9930 2.6731 1.3734 0.8458 1.7934 1.3875 1.0824 1.8849 11.4895 7.5154 26.9890 2.1406 7.1456 6.0162 4.2934 0.7130 24.4846 1.9132 4.0154 34.0268 55.7537 22.1810 8.3918 8.8219 0.0738 9.0737 109.6458 12.0771 2.5344 2.9634 2.9716 5.0777 6.1871 2.2038 9.9331 11.7148 8.6222 6.1130 3.0141 0.7380 31.2875 94.5463 70.9728 20.1215 18.6493 250.5544 34.7146 16.4845 108.5163 208.0070 74.6060 65.2367 66.1412 11.1954 49.4746 166.2141 76.9354 10.9224 15.1508 72.5312 5.7516 31.8570 68.9366 1.9159 4.1492 12.2902 36.0487 18.4690 23.6005 18.3321 59.3274 8.2250 40.3652 13.3557 17.7098 9.4671 13.2102 0.8004 16.3034 12.5773 18.4725 262.9942 4.9828 191.3023 74.7440 228.1243 51.9017 30.1247 28.1025 17.3117 16.2726 31.6081 26.3138 5.7491 43.3253 40.0274 33.9817 0.7355 1.3976 38.4251 27.3082 27.7093 2.2224 16.9773 28.1331 17.5891 96.8304
temp: 298.150 k
press: 1.00000 atm
elementType: 8 8 8 8 8 7 6 6 6 6 6 6 6 6 6 6 6 6 6 6 6 1 1 1 1 1 1 1 1 1 1 1 1 1 1 1 1 1 1 1 1 1
symmnumber: 1
zpe: 893060.2 jmol-1
zpe.correction: 0.340149 hartree
zpe.thermalcorrener: 0.362370 hartree
zpe.thermalcorrenthalpy: 0.363314 hartree
zpe.thermalcorrgfe: 0.286382 hartree
zpe.sumelectzpe: -1013.454436 hartree
zpe.sumelectthermal: -1013.432214 hartree
zpe.sumelectthermalent: -1013.431270 hartree
zpe.sumelectthermalfe: -1013.508202 hartree
dipole: 1.4868 -0.1049 -1.2762
dipole: 1.9622
quadrupole: -94.6937 -110.1215 -130.9088
quadrupole: 3.8752 -6.9435 -0.9254
quadrupole: 17.2143 1.7865 -19.0008 3.8752 -6.9435 -0.9254
hfenergy: -1013.7945843 hartree
pointgroup: C01 [X(C15H21N1O5)]
dipole: -0.610299 -0.3837084 0.2761835 debye
polarizability: 230.1807438|-3.8195532|138.9083142|2.9039677|26.621497|204.6595839 unknown
InChI: InChI=1S/C15H21NO5/c1-4-19-12-10-8-7-9-11(12)16-13(14(17)20-5-2)15(18)21-6-3/h7-10,13,16H,4-6H2,1-3H3
charge 0 multiplicity 1
42 atoms
O  2.519542 -0.099535 -1.665899
O  -2.142413 1.391532 1.661714
O  -3.436226 -0.578844 -0.84345
O  -1.776701 2.417083 -0.407608
O  -1.701731 -0.793585 -2.393046
N  0.14062 0.000537 -0.534278
C  -1.233718 -0.000926 -0.094265
C  1.236713 0.081171 0.326218
C  2.545201 0.010384 -0.258323
C  -1.743101 1.410178 0.328715
C  -2.116585 -0.505303 -1.250523
C  1.133495 0.222194 1.734142
C  3.698661 0.068638 0.544068
C  2.297477 0.274536 2.537978
C  3.576852 0.199766 1.951921
C  3.791648 -0.236461 -2.398672
C  -2.643132 2.686921 2.228616
C  -4.4336 -1.033381 -1.868682
C  4.346132 -1.66721 -2.340679
C  -1.478949 3.544626 2.730472
C  -4.513318 -2.560989 -1.903046
H  -1.392137 -0.670163 0.775082
H  0.320348 -0.075305 -1.538898
H  0.148085 0.304824 2.20383
H  4.694436 0.010662 0.09366
H  2.194892 0.378591 3.623801
H  4.478308 0.243048 2.571828
H  3.526433 0.037579 -3.43342
H  4.522752 0.505609 -2.020557
H  -3.310403 2.367008 3.044546
H  -3.219532 3.2076 1.443765
H  -4.136798 -0.618454 -2.847645
H  -5.373942 -0.57289 -1.527641
H  4.596608 -1.968653 -1.309471
H  3.603983 -2.380689 -2.738085
H  5.262199 -1.740907 -2.956433
H  -1.874158 4.452937 3.22233
H  -0.831892 3.858682 1.894815
H  -0.867718 2.992546 3.465003
H  -5.311454 -2.873358 -2.601706
H  -4.751363 -2.966504 -0.904744
H  -3.562415 -2.997495 -2.251234
