program: Gaussian 09
title: 000246387
version: EM64L-G09RevD.01
frameworkgroup: C1[X(C11H6N2O2S)]
method: RPBEPBE
basis: SDD
operation: Freq
keyword: #p
keyword: freq=noraman
keyword: PBEPBE/SDD
title: #p freq=noraman PBEPBE/SDD
converged: NO NO NO NO
title: Mulliken charges:
elementType: S O O N N C C C C C C C C C C C H H H H H H
charge: 0.331604 -0.183038 -0.129494 -0.244642 -0.017180 0.187764 0.179015 0.129351 0.093905 -0.344811 -0.342970 -0.131856 -0.209390 -0.208984 -0.494532 -0.178439 0.272769 0.273859 0.242495 0.242576 0.268388 0.263610
chargesum: 0.00000
title: Mulliken charges with hydrogens summed into heavy atoms:
elementType: S O O N N C C C C C C C C C C C
charge: 0.331604 -0.183038 -0.129494 -0.244642 -0.017180 0.187764 0.179015 0.129351 0.093905 -0.072042 -0.069111 -0.131856 0.033105 0.033592 -0.226143 0.085171
polarizability: 2.65041952e+02 2.39091164e+00 1.65709274e+02 -3.23954102e-03 6.34346887e-03 5.59156230e+01
1716.lowfreq: -0.0024 -0.0009 -0.0003 5.8517 8.1852 11.2354 16.6820 52.0612 122.5096
frequency: 15.5310 52.0448 122.5093 132.3188 161.2969 184.4255 252.0332 256.0608 313.9637 327.6037 347.3914 415.0541 451.3817 511.8104 523.2369 546.5298 564.5907 600.2787 625.5295 654.1792 682.7961 697.7810 709.6939 730.2080 763.7094 782.3943 795.9694 835.9397 859.5267 872.8038 908.1414 946.2381 977.4851 1008.2036 1009.7266 1046.6359 1065.8719 1086.1996 1146.1224 1172.2477 1174.6918 1228.3339 1282.3923 1284.8804 1306.7733 1414.8746 1451.7644 1452.9409 1458.8943 1506.8848 1612.0111 1620.4462 1637.5990 1691.6307 3142.0538 3155.4082 3166.7373 3176.2728 3203.9298 3243.0537
redmass: 9.9082 6.8898 6.9828 5.0218 9.6866 5.8862 9.5648 9.5996 10.4611 7.3125 9.8277 3.2358 4.8518 4.6758 7.6526 10.8480 13.5651 5.3919 10.4583 4.7833 7.7191 7.6505 3.0959 1.2785 7.1309 5.2401 1.6090 6.0010 7.6807 1.3303 1.3876 8.4422 1.4092 1.3515 2.3271 1.5336 3.6469 3.4507 1.9670 1.4126 1.5419 3.8560 1.5220 1.6445 8.7304 7.4134 2.4444 5.1803 2.6713 10.4501 7.4883 8.0367 12.6630 12.8993 1.0867 1.0908 1.0957 1.1004 1.0912 1.1021
irintensity: 0.1460 4.9302 4.0898 0.0001 0.7806 0.5301 4.3035 0.5200 4.5073 1.7004 6.1390 2.7474 0.0650 6.3345 9.5997 0.9307 6.5675 10.1184 27.7028 0.1169 11.7941 7.4780 95.8053 53.2055 26.7066 0.7651 41.3506 2.8773 35.5797 2.2776 0.0106 26.2176 2.4079 0.0002 4.7076 10.3216 80.1426 26.4428 65.3264 16.4597 7.8040 101.4569 10.1382 9.6373 405.6953 32.9877 12.7406 0.3464 3.4845 158.5731 28.4903 0.8614 359.5667 52.7339 1.8075 4.9492 3.7287 19.5116 7.1891 0.9975
temp: 298.150 k
press: 1.00000 atm
elementType: 16 8 8 7 7 6 6 6 6 6 6 6 6 6 6 6 1 1 1 1 1 1
symmnumber: 1
zpe: 385000.4 jmol-1
zpe.correction: 0.146639 hartree
zpe.thermalcorrener: 0.159025 hartree
zpe.thermalcorrenthalpy: 0.159970 hartree
zpe.thermalcorrgfe: 0.106152 hartree
zpe.sumelectzpe: -1079.696769 hartree
zpe.sumelectthermal: -1079.684383 hartree
zpe.sumelectthermalent: -1079.683438 hartree
zpe.sumelectthermalfe: -1079.737256 hartree
dipole: -3.3602 -1.1851 -0.0002
dipole: 3.5631
quadrupole: -64.2237 -107.5569 -100.7750
quadrupole: 0.2887 -0.0018 0.0001
quadrupole: 26.6282 -16.7051 -9.9231 0.2887 -0.0018 0.0001
hfenergy: -1079.843408 hartree
pointgroup: C01 [X(C11H6N2O2S1)]
dipole: 1.349844 0.3782203 -0.0015032 debye
dipolederiv: 0.2021668 0.0582389 -0.000226 0.3665439 -0.3483601 0.0024697 -0.001557 0.0024059 0.1700765 -0.6524447 0.1922687 -0.0007534 -0.0768957 -0.9125753 0.0023788 0.0002369 0.0025854 -0.2962967 -0.4578028 -0.1486514 0.0004816 0.1305534 -0.977596 0.0026151 -0.0005557 0.002704 -0.2779576 -1.812282 0.1328984 -0.0006259 0.1871865 -1.1525105 0.0043258 -0.0008288 0.0042685 -0.0798881 -0.3418578 -0.1486326 0.0006956 -0.1729421 -0.6023723 0.0021385 0.0009225 0.0021149 -0.1628719 -0.5131892 0.2166944 -0.0009234 0.2126947 -0.0689547 0.0002958 -0.0007794 0.000332 -0.0024092 -0.5417993 -0.1659825 0.000609 -0.1700718 -0.0952366 0.0002997 0.0005834 0.0003015 -0.013694 1.4099995 -0.035238 0.0002812 0.4435021 1.3016486 -0.0041771 -0.0018548 -0.0044223 0.2291548 1.4087973 -0.07651 0.0004322 -0.654962 1.5279618 -0.0047927 0.0027821 -0.004942 0.2579881 -0.012877 -0.1048914 0.0004067 0.1043174 0.1342117 -0.0008913 -0.0003794 -0.0009148 -0.095488 -0.0281963 0.0743177 -0.000286 -0.1188777 0.148017 -0.0009615 0.0004147 -0.0009333 -0.0937426 1.3116198 -0.200144 0.0008547 -0.330883 0.7098065 -0.0036085 0.0015374 -0.0034626 -0.0092171 0.0647659 0.1293524 -0.0004688 0.1898643 -0.0484903 -0.0003333 -0.0007321 -0.000332 -0.1359891 0.0590983 -0.1058609 0.0004474 -0.1677565 -0.0279848 -0.0004408 0.0007044 -0.0004455 -0.134509 -0.2551716 0.1100299 -0.0005235 -0.1338216 0.069128 -0.0018732 0.0005592 -0.0017887 -0.3309265 0.0375057 0.0837267 -0.0003413 0.2966921 0.1298005 -0.000999 -0.0015199 -0.0009914 -0.088587 0.1104548 0.0281231 -0.0001201 -0.0163883 -0.0167266 0.0006937 0.0000838 0.0006922 0.1604738 0.1077385 -0.0271755 0.000101 0.0229193 -0.015017 0.0006882 -0.0001093 0.0006742 0.1600312 -0.0670355 -0.0745506 0.0002613 -0.083192 0.0504573 0.0004171 0.0002718 0.0004226 0.1592182 -0.0701868 0.0738728 -0.0003218 0.0783901 0.0555941 0.0004191 -0.0003206 0.000424 0.1593099 0.0102643 0.0276527 -0.0001523 0.0129483 0.1036405 0.0005909 -0.0000127 0.0005714 0.2301226 0.0304318 -0.039539 0.0001717 -0.1198215 0.0355583 0.000745 0.0005538 0.000736 0.1952015 unknown
polarizability: 264.9255822|-4.1546293|165.8237041|0.0386572|-0.461454|55.9175622 unknown
InChI: InChI=1S/C11H6N2O2S/c14-9-7-3-1-2-4-8(7)10(15)13(9)11-12-5-6-16-11/h1-6H
charge 0 multiplicity 1
22 atoms
S  -2.979146 1.593516 -0.007423
O  -0.258945 2.34637 -0.009519
O  -0.16655 -2.403811 0.009365
N  -0.625712 -0.016895 0.000144
N  -2.783536 -1.0919 0.005231
C  1.603536 0.70998 -0.002607
C  1.621266 -0.701359 0.002975
C  0.190957 1.176443 -0.004534
C  0.219105 -1.221079 0.00475
C  2.789357 1.461703 -0.005455
C  2.827294 -1.418987 0.005962
C  -2.029351 -0.005029 0.000153
C  4.016432 0.747368 -0.002456
C  4.035017 -0.671482 0.003169
C  -4.458845 0.575119 -0.002882
C  -4.147504 -0.773641 0.00358
H  2.762203 2.555789 -0.009754
H  2.828921 -2.5134 0.010231
H  4.962133 1.299671 -0.004484
H  4.995095 -1.198386 0.005368
H  -5.442059 1.042249 -0.005176
H  -4.86987 -1.590039 0.007363
