program: Gaussian 09
title: 000246399
version: EM64L-G09RevD.01
frameworkgroup: C1[X(C12H20O5)]
method: RPBEPBE
basis: SDD
operation: Freq
keyword: #pfreq=noraman
keyword: PBEPBE/SDD
title: #p freq=noraman PBEPBE/SDD
converged: NO YES NO NO
title: Mulliken charges:
elementType: O O O O O C C C C C C C C C C C C H H H H H H H H H H H H H H H H H H H H
charge: -0.256432 -0.295794 -0.250366 -0.299363 -0.267741 -0.031796 -0.135978 -0.496010 -0.102324 -0.090984 0.363353 -0.400389 0.367403 -0.679326 -0.687374 -0.678665 -0.706460 0.235027 0.242890 0.260288 0.260807 0.241433 0.234690 0.243291 0.214706 0.218788 0.242110 0.220438 0.223330 0.218553 0.233431 0.221875 0.225753 0.228015 0.221245 0.241711 0.219863
chargesum: 0.00000
title: Mulliken charges with hydrogens summed into heavy atoms:
elementType: O O O O O C C C C C C C C C C C C
charge: -0.256432 -0.295794 -0.250366 -0.299363 -0.267741 0.203231 0.106913 0.025085 0.139109 0.143706 0.363353 0.057608 0.367403 0.002010 -0.012059 -0.003023 -0.023641
polarizability: 1.78630833e+02 -2.62408965e+00 1.24092932e+02 1.93713604e+00 1.11179961e+00 1.20218201e+02
1716.lowfreq: -14.3253 -0.0007 -0.0006 -0.0004 6.6926 10.7429 32.2926 41.5485 47.3154
frequency: 32.2130 41.4608 47.0324 58.3474 92.8937 129.1660 136.2370 152.5886 164.7928 204.2460 215.0382 220.0695 260.8874 300.8517 306.0956 321.2240 342.3320 351.0498 394.7016 420.4292 438.2430 476.9147 495.5795 535.5061 563.6155 618.9522 622.2618 638.8739 720.1970 731.4813 732.3667 746.9731 750.8593 805.4868 822.7695 840.7645 861.5707 894.1910 907.5715 916.8389 921.3304 935.3970 941.0775 958.6678 967.6042 980.9155 983.1297 984.3678 1011.3866 1035.8347 1037.9549 1074.8815 1129.3956 1136.7607 1143.3800 1167.4764 1192.9858 1204.2937 1210.8974 1231.3535 1240.2474 1247.2311 1258.3255 1264.4423 1282.4225 1292.3398 1309.6021 1320.9839 1329.5534 1347.6836 1378.0012 1379.1502 1382.1034 1390.5981 1391.6394 1448.1281 1449.8287 1452.1495 1452.7517 1454.5442 1466.8124 1469.4696 1472.5340 1473.9390 1489.5487 2994.6665 2998.2843 2999.6181 3003.3924 3004.5923 3007.6071 3023.7593 3032.9865 3038.2406 3087.7676 3097.0970 3099.4268 3100.0417 3103.6242 3107.3902 3109.5241 3109.8993 3111.3274 3114.6787 3119.4928
redmass: 3.9919 3.6459 3.6531 4.3840 4.0625 4.2409 4.7296 1.0494 1.0501 2.0077 1.0973 1.3686 2.5360 3.1408 3.2423 2.4558 2.6727 2.6083 2.8383 2.6504 3.4288 3.6108 4.6376 3.4609 4.0239 4.0889 4.6432 5.1797 6.8479 5.8364 5.3552 4.1847 3.4660 4.4116 4.2429 4.9391 3.4661 2.4170 3.0990 1.7502 1.4651 2.0245 3.3608 3.2742 2.5515 2.7267 1.4134 1.3677 2.5268 4.0084 2.0830 2.2467 1.5427 1.7166 1.7575 1.2745 1.6720 2.3128 2.3248 2.1943 1.9133 2.0459 1.6390 2.0563 1.3990 1.3223 1.3361 1.3207 1.1628 1.6775 1.3005 1.2967 1.3935 1.2228 1.2348 1.0512 1.0607 1.0686 1.0504 1.0676 1.0580 1.0690 1.0531 1.0485 1.0787 1.0465 1.0563 1.0354 1.0440 1.0744 1.0356 1.0712 1.0862 1.0801 1.0893 1.1000 1.1001 1.1000 1.0994 1.0996 1.0996 1.1007 1.1005 1.1001 1.1002
irintensity: 0.2225 0.8317 2.6200 1.7737 2.4824 6.3862 0.2034 0.0727 0.0549 1.1866 1.8065 2.5276 8.2733 3.2450 1.3966 3.1178 2.6555 2.5210 3.2221 3.3075 3.3329 13.8301 16.5079 6.5852 5.1208 1.8833 3.6155 5.8608 18.1757 10.3384 11.9408 20.9455 37.7309 4.4205 44.7771 16.9417 5.6050 34.8777 149.3228 38.0752 0.1946 5.7597 98.0903 29.9328 136.0805 96.2901 7.6416 13.9144 5.0329 55.4748 37.7544 35.3872 9.8972 67.1770 38.3692 2.6697 46.8619 151.7811 61.4660 38.2896 25.5837 20.6840 9.7894 22.5022 7.1902 0.3932 5.1295 1.6906 0.3972 0.6372 43.4780 49.3529 0.3521 31.8697 25.5456 1.1101 8.6763 5.0429 2.7537 4.9370 4.2581 0.3090 13.4000 22.7008 9.4098 7.0527 43.4307 11.3502 31.7333 17.3926 11.9972 7.2020 37.6344 45.0905 33.7691 26.4407 0.4044 7.2493 16.7551 30.5934 25.6493 19.0280 9.9934 34.4292 27.8858
temp: 298.150 k
press: 1.00000 atm
elementType: 8 8 8 8 8 6 6 6 6 6 6 6 6 6 6 6 6 1 1 1 1 1 1 1 1 1 1 1 1 1 1 1 1 1 1 1 1
symmnumber: 1
zpe: 809089.6 jmol-1
zpe.correction: 0.308166 hartree
zpe.thermalcorrener: 0.325718 hartree
zpe.thermalcorrenthalpy: 0.326663 hartree
zpe.thermalcorrgfe: 0.262385 hartree
zpe.sumelectzpe: -844.010991 hartree
zpe.sumelectthermal: -843.993439 hartree
zpe.sumelectthermalent: -843.992494 hartree
zpe.sumelectthermalfe: -844.056772 hartree
dipole: -0.8355 0.4958 -0.5318
dipole: 1.1076
quadrupole: -94.5995 -105.1987 -100.7939
quadrupole: 3.4775 -1.8284 0.3378
quadrupole: 5.5978 -5.0013 -0.5966 3.4775 -1.8284 0.3378
hfenergy: -844.3191572 hartree
pointgroup: C01 [X(C12H20O5)]
dipole: -0.3205962 0.1088104 0.2743279 debye
polarizability: 178.3915963|-2.7498644|122.0718043|-4.1555976|-2.0551777|122.4785655 unknown
InChI: InChI=1S/C12H20O5/c1-11(2)13-6-9(16-11)7-5-8-10(14-7)17-12(3,4)15-8/h7-10H,5-6H2,1-4H3
charge 0 multiplicity 1
37 atoms
O  0.772173 0.564275 -1.333221
O  2.487109 -0.338904 1.199193
O  3.181781 0.603376 -0.864435
O  -2.402397 -0.986221 -0.10857
O  -2.96642 1.276857 0.241836
C  -0.093172 -0.235778 -0.411464
C  1.6057 0.821909 0.927657
C  0.135211 0.38533 0.983005
C  1.878119 1.160213 -0.566169
C  -1.51929 -0.173598 -0.985491
C  3.493851 -0.483886 0.107699
C  -2.164247 1.233535 -0.998559
C  -3.480814 -0.097261 0.430436
C  3.321065 -1.857586 -0.547111
C  4.897973 -0.225861 0.656609
C  -4.771114 -0.323964 -0.373674
C  -3.629903 -0.350378 1.927402
H  0.24332 -1.290658 -0.41717
H  1.859403 1.645636 1.617751
H  -0.520379 1.260502 1.139571
H  -0.038839 -0.335383 1.796178
H  1.929626 2.222965 -0.846875
H  -1.514253 -0.621852 -1.995685
H  -1.425363 2.047296 -0.948311
H  -2.80773 1.373619 -1.888126
H  4.073567 -1.993099 -1.342756
H  2.319019 -1.946393 -0.996632
H  3.450042 -2.653348 0.206735
H  5.636514 -0.246631 -0.163299
H  5.163333 -1.00095 1.395777
H  4.937672 0.761557 1.145129
H  -5.5777 0.325133 0.009314
H  -4.615333 -0.100956 -1.443164
H  -5.086645 -1.377706 -0.286001
H  -3.933007 -1.395977 2.104689
H  -2.671114 -0.164917 2.437136
H  -4.396859 0.319405 2.352399
