program: Gaussian 09
title: 000246396
version: EM64L-G09RevD.01
frameworkgroup: C1[X(C11H17N5O4)]
method: RPBEPBE
basis: SDD
operation: Freq
keyword: #p
keyword: freq=noraman
keyword: PBEPBE/SDD
title: #p freq=noraman PBEPBE/SDD
converged: YES YES NO NO
title: Mulliken charges:
elementType: O O O O N N N N N C C C C C C C C C C C H H H H H H H H H H H H H H H H H
charge: -0.284889 -0.425671 -0.436576 -0.274805 -0.116188 -0.453854 -0.167928 -0.134545 -0.216608 0.247920 0.131490 0.104314 -0.417807 -0.400730 0.130607 0.206971 -0.316380 -0.322364 -0.618727 -0.600363 0.331941 0.203517 0.270690 0.257063 0.219214 0.226418 0.202450 0.251925 0.200939 0.273952 0.241658 0.242289 0.267461 0.246982 0.247725 0.341924 0.339988
chargesum: 0.00000
title: Mulliken charges with hydrogens summed into heavy atoms:
elementType: O O O O N N N N N C C C C C C C C C C C
charge: -0.284889 -0.083747 -0.096588 -0.274805 -0.116188 -0.121914 -0.167928 -0.134545 -0.216608 0.247920 0.131490 0.104314 0.056400 0.075546 0.130607 0.206971 0.112487 0.130500 0.139172 0.161804
polarizability: 2.53569513e+02 6.10800874e+00 1.78517695e+02 4.30793011e+00 1.75488802e+01 1.03137225e+02
1716.lowfreq: -5.3975 -0.0007 -0.0006 -0.0005 1.0085 4.7890 29.0225 32.3302 36.4821
frequency: 28.4749 32.2776 36.2966 57.2853 83.2832 87.1714 94.2193 109.1718 116.0053 121.0971 125.3181 156.7081 186.8674 210.9027 223.1722 256.8524 273.7406 286.3255 300.9888 308.7157 320.7555 343.9182 355.3955 357.6335 375.3707 390.4620 450.9892 479.2441 488.1564 526.4172 543.9246 572.6822 638.5431 648.0944 693.9666 701.5022 706.0581 727.8844 764.9824 789.0345 835.6761 884.8415 924.3979 949.0443 963.5209 966.4256 991.5390 1024.0537 1029.7810 1039.0467 1048.0922 1073.6012 1101.0169 1129.6153 1131.8306 1143.9059 1187.3139 1193.4201 1217.4392 1227.6791 1249.0067 1264.9871 1277.8893 1295.4084 1301.8240 1323.3714 1331.9456 1347.2332 1364.2280 1370.6164 1376.7540 1384.4403 1391.1889 1414.2882 1431.0920 1443.0681 1460.8946 1466.9412 1473.2717 1474.0557 1478.8853 1479.1034 1490.7518 1506.5387 1563.2669 1603.5832 1637.0482 1664.0015 2968.2196 2968.8160 2975.7711 2997.0938 3003.6694 3009.2545 3070.3626 3076.9509 3091.7485 3094.4390 3100.6971 3103.3996 3134.3619 3136.2024 3563.2409 3569.5606 3612.0992
redmass: 5.7116 5.5126 5.7387 5.0974 2.0400 1.4136 2.1995 2.9924 1.5863 2.3740 3.2330 4.0427 4.7342 5.5217 4.9212 3.1541 1.7347 1.2872 2.4436 2.5869 3.0273 3.1419 5.3833 3.8618 4.3327 6.7083 5.7910 3.7750 6.8958 3.3709 1.1808 3.9866 11.2656 4.2874 9.1416 10.9077 7.1823 11.1163 4.7489 1.1810 3.2172 2.6857 4.6774 2.6105 3.5033 4.1104 2.6526 2.2524 3.0939 2.7108 2.7532 1.5295 4.0123 1.3008 1.2985 1.3868 2.5399 1.4817 2.7672 2.7633 1.9259 4.5894 1.5826 1.7292 1.4320 1.6870 1.5213 1.2592 3.6213 1.2323 1.2459 1.3467 2.8314 1.3395 1.4223 1.0889 1.0864 1.3595 1.0491 1.1188 1.0643 1.0461 1.1484 2.2373 7.0606 7.4805 9.0142 10.2580 1.0689 1.0684 1.0697 1.0634 1.0336 1.0326 1.0996 1.0922 1.1024 1.0979 1.1021 1.0968 1.1024 1.1008 1.0665 1.0666 1.0810
irintensity: 0.2781 0.8070 1.6884 2.4311 1.2700 1.0778 6.4503 3.6280 1.2193 2.6234 5.6743 16.5393 14.9631 4.3333 2.4277 51.7280 120.0435 111.2890 12.5338 5.6008 12.7692 28.9100 2.6193 27.1142 6.2925 16.9601 4.2683 21.9335 29.8407 10.3357 114.1788 9.3947 9.9398 0.7522 0.0972 2.3993 0.7217 20.4373 0.8566 11.1606 6.9511 48.0696 5.6008 7.9883 111.6440 113.5365 114.1103 9.3897 8.3308 40.1843 15.5078 4.2106 24.0459 0.3424 0.1412 18.4000 72.3873 2.7306 42.0835 5.4725 42.0144 15.4846 40.0392 4.4080 3.7853 64.7976 120.4240 7.4251 52.3112 10.3080 14.8895 28.6911 33.8360 32.7073 38.2401 17.1466 7.2805 121.7884 18.1623 2.0806 4.7550 18.2174 100.5808 344.3913 219.6140 863.9225 294.3056 429.8282 55.3645 55.7668 26.1880 59.5279 39.7221 34.3682 4.8267 13.6030 20.4000 13.8604 19.4941 24.2995 0.6970 0.4702 7.1573 12.4175 48.7658
temp: 298.150 k
press: 1.00000 atm
elementType: 8 8 8 8 7 7 7 7 7 6 6 6 6 6 6 6 6 6 6 6 1 1 1 1 1 1 1 1 1 1 1 1 1 1 1 1 1
symmnumber: 1
zpe: 767845.2 jmol-1
zpe.correction: 0.292457 hartree
zpe.thermalcorrener: 0.313462 hartree
zpe.thermalcorrenthalpy: 0.314406 hartree
zpe.thermalcorrgfe: 0.241214 hartree
zpe.sumelectzpe: -1002.514081 hartree
zpe.sumelectthermal: -1002.493075 hartree
zpe.sumelectthermalent: -1002.492131 hartree
zpe.sumelectthermalfe: -1002.565324 hartree
dipole: -5.6726 -1.6883 -1.2062
dipole: 6.0402
quadrupole: -128.4553 -115.6652 -123.0363
quadrupole: 7.8088 2.2612 4.5562
quadrupole: -6.0697 6.7204 -0.6507 7.8088 2.2612 4.5562
hfenergy: -1002.8065373 hartree
pointgroup: C01 [X(C11H17N5O4)]
dipole: -2.2618252 -0.5840491 0.4361301 debye
polarizability: 253.7879728|8.3420632|109.6183413|0.4523366|-26.8834505|171.8181184 unknown
InChI: InChI=1S/C11H17N5O4/c1-14-8-7(9(19)15(2)11(14)20)12-10(13-8)16(3-5-17)4-6-18/h12,17-18H,3-6H2,1-2H3
charge 0 multiplicity 1
37 atoms
O  2.293244 1.243689 -2.548614
O  -4.426375 -0.242043 -3.322009
O  -4.566576 1.345105 1.623237
O  4.477549 -0.305831 1.349731
N  -2.477627 -0.130559 -0.064479
N  -0.338583 0.45555 -1.097786
N  2.132831 -0.426108 1.303319
N  -0.325538 -0.447491 1.006738
N  3.375382 0.46156 -0.572193
C  -1.105602 -0.046157 -0.050092
C  1.011385 0.369713 -0.696546
C  0.971302 -0.188131 0.58686
C  -3.272775 0.364617 -1.202122
C  -3.157746 -0.67074 1.130412
C  2.20807 0.738436 -1.382827
C  3.392443 -0.101972 0.73079
C  -3.480207 -0.708609 -2.302431
C  -3.549105 0.41731 2.150193
C  2.077628 -1.015577 2.65357
C  4.700706 0.789783 -1.143221
H  -0.642297 0.82088 -1.997378
H  -2.801054 1.273623 -1.629836
H  -4.255358 0.688456 -0.822673
H  -2.46831 -1.380631 1.620106
H  -4.056977 -1.2270 0.801279
H  -3.95547 -1.603466 -1.86773
H  -2.511596 -1.016557 -2.749961
H  -2.674449 1.046054 2.378009
H  -3.895267 -0.064162 3.08942
H  3.111318 -1.103558 3.018372
H  1.601921 -2.010219 2.614819
H  1.489967 -0.368487 3.326454
H  4.525828 1.224041 -2.13875
H  5.317845 -0.120509 -1.221469
H  5.226599 1.508062 -0.493112
H  -4.003171 0.458724 -3.878964
H  -5.453331 0.904307 1.648087
