program: Gaussian 09
title: 000246404
version: EM64L-G09RevD.01
frameworkgroup: C1[X(C15H12ClNO4)]
method: RPBEPBE
basis: SDD
operation: Freq
keyword: #p
keyword: freq=noraman
keyword: PBEPBE/SDD
title: #p freq=noraman PBEPBE/SDD
converged: YES YES NO NO
title: Mulliken charges:
elementType: Cl O O O O N C C C C C C C C C C C C C C C H H H H H H H H H H H H
charge: -0.026401 -0.226773 -0.408916 -0.422034 -0.334924 -0.428962 -0.731480 0.507882 0.565624 0.270292 -0.602003 -0.369658 0.106937 0.198300 -0.400744 -0.390919 -0.313309 -0.214361 -0.228700 -0.232856 0.167345 0.318844 0.345432 0.255815 0.310444 0.246615 0.275050 0.271280 0.235927 0.236403 0.238260 0.390074 0.391519
chargesum: 0.00000
title: Mulliken charges with hydrogens summed into heavy atoms:
elementType: Cl O O O O N C C C C C C C C C C C C C C C
charge: -0.026401 -0.226773 -0.018842 -0.030515 -0.334924 -0.083530 -0.412636 0.507882 0.565624 0.270292 -0.346188 -0.059215 0.106937 0.198300 -0.154130 -0.115868 -0.042029 0.021565 0.007704 0.005404 0.167345
polarizability: 2.78045475e+02 1.73744819e-01 1.94176107e+02 5.01097868e+00 2.11072592e+01 1.47289154e+02
1716.lowfreq: -6.6464 0.0005 0.0015 0.0019 1.4807 4.2913 14.2262 23.8314 41.6188
frequency: 13.8143 23.7588 41.6149 52.8132 66.1566 94.7434 107.7238 120.5833 160.3028 175.1384 198.5692 234.4709 240.8247 288.1510 298.2079 314.7547 341.2094 370.2519 400.1414 423.3423 451.4707 473.6160 514.7280 556.1288 568.3212 572.4983 581.8306 613.2497 622.2635 657.6073 663.1867 684.1515 705.5970 708.7867 724.6008 749.3297 753.7539 761.0328 808.2120 834.9444 847.9551 857.4598 859.9262 877.9746 905.2898 932.2638 980.3517 983.8175 989.0769 996.9470 1003.5199 1025.7619 1027.3856 1083.7878 1122.5136 1159.1690 1176.0483 1176.2299 1188.4852 1192.8765 1202.6326 1223.8561 1238.7244 1269.4664 1310.6984 1319.2021 1327.4798 1371.6294 1381.4560 1403.9826 1436.6319 1450.7051 1479.5962 1495.8422 1505.5974 1582.8770 1587.0596 1589.8153 1607.0848 1624.0018 1658.9511 3018.6431 3106.8493 3126.6627 3128.9348 3142.0246 3150.7124 3153.4480 3169.0296 3169.9323 3207.4756 3480.2022 3533.0255
redmass: 6.9310 6.3697 4.3753 7.6643 9.1492 7.4790 6.9571 11.6112 7.2177 9.1327 5.2536 7.1683 5.6729 6.9527 5.4514 6.6387 8.3592 7.9419 2.8702 8.6863 2.8394 4.8883 5.0137 4.9980 6.6521 1.2609 6.7906 6.4086 3.3353 4.9682 5.2361 3.1883 1.9122 1.5418 4.7943 4.1906 3.2543 2.3309 4.9137 4.4583 1.1536 1.4226 1.2552 1.6951 5.3171 1.4469 3.1332 1.7292 3.5781 1.3152 1.3254 4.7009 2.2501 1.6040 1.7552 2.2519 1.5504 1.0694 1.2930 1.2850 1.6143 1.6536 1.8511 1.7260 2.0338 2.3358 1.2883 3.9357 7.3156 6.7214 2.1731 2.9289 2.2401 3.5220 2.0527 4.8562 4.5135 5.1225 6.0243 5.4247 5.2116 1.0688 1.0876 1.0869 1.0877 1.0911 1.0923 1.0959 1.0909 1.1015 1.0955 1.0765 1.0641
irintensity: 0.2309 0.5555 1.0874 0.0378 5.0853 0.7870 1.8572 4.2538 3.9405 1.5036 0.2743 1.4672 1.0731 1.0083 0.9178 0.5603 7.6578 18.4153 1.5981 15.8299 25.5620 2.7939 35.5429 7.7318 4.6019 117.3979 11.7743 0.0306 1.1319 33.7259 51.7911 66.7953 59.5057 45.2959 9.9910 23.0060 3.3570 25.4636 0.8939 7.9864 189.2282 22.5291 0.9067 40.9237 6.9123 3.8752 20.6982 3.0631 0.8125 1.0677 0.0646 294.3442 41.1720 6.6459 139.1084 48.7611 81.7817 1.5498 1.4603 3.0395 88.5375 54.8889 23.0746 13.1475 186.9896 35.7976 10.8917 450.1429 14.8111 34.5567 15.8108 209.0940 13.3064 137.2736 364.8962 37.4039 186.4860 35.4821 15.7858 254.1052 386.9970 292.7765 0.3130 3.6349 0.5232 4.7722 4.1891 21.5361 1.2386 20.2603 5.5514 79.7392 85.1752
temp: 298.150 k
press: 1.00000 atm
elementType: 17 8 8 8 8 7 6 6 6 6 6 6 6 6 6 6 6 6 6 6 6 1 1 1 1 1 1 1 1 1 1 1 1
symmnumber: 1
zpe: 632902.0 jmol-1
zpe.correction: 0.241060 hartree
zpe.thermalcorrener: 0.259469 hartree
zpe.thermalcorrenthalpy: 0.260413 hartree
zpe.thermalcorrgfe: 0.191376 hartree
zpe.sumelectzpe: -1393.060116 hartree
zpe.sumelectthermal: -1393.041707 hartree
zpe.sumelectthermalent: -1393.040763 hartree
zpe.sumelectthermalfe: -1393.109800 hartree
dipole: -1.5486 2.2573 -1.3388
dipole: 3.0473
quadrupole: -111.3565 -134.8205 -126.7722
quadrupole: -19.0177 0.0838 -0.9371
quadrupole: 12.9599 -10.5041 -2.4558 -19.0177 0.0838 -0.9371
hfenergy: -1393.3011761 hartree
pointgroup: C01 [X(C15H12Cl1N1O4)]
dipole: 0.6638183 0.8210507 0.5679876 debye
polarizability: 277.8090713|-5.2945861|196.7215172|2.3218054|-18.5166032|144.9801479 unknown
InChI: InChI=1S/C15H12ClNO4/c16-13(9-4-2-1-3-5-9)14(19)17-10-6-7-11(15(20)21)12(18)8-10/h1-8,13,17-18,20H
charge 0 multiplicity 1
33 atoms
Cl 2.991326 -2.170122 -2.086971
O  0.898292 -2.676144 0.728505
O  -3.155789 2.295215 -1.189203
O  -5.826205 -0.504836 0.58171
O  -5.53377 1.539453 -0.466939
N  0.581322 -0.593725 -0.331222
C  2.842789 -1.586412 -0.274005
C  3.48766 -0.229642 -0.05956
C  -0.815662 -0.388819 -0.217836
C  1.340083 -1.677667 0.094107
C  -1.327689 0.823262 -0.737501
C  -1.68762 -1.348817 0.38564
C  -3.597942 0.142101 -0.06494
C  -2.708238 1.100481 -0.668228
C  3.987132 0.063064 1.237169
C  3.556833 0.764842 -1.068097
C  -3.056392 -1.06821 0.450222
C  4.527877 1.335189 1.523876
C  4.102564 2.035895 -0.779248
C  4.58393 2.327459 0.517459
C  -5.020527 0.458774 -0.010821
H  3.346422 -2.378125 0.298662
H  1.109424 0.16554 -0.774693
H  -0.675633 1.570037 -1.202856
H  -1.276217 -2.275535 0.785794
H  3.94847 -0.702268 2.021686
H  3.231095 0.524515 -2.086869
H  -3.741433 -1.788784 0.906182
H  4.910957 1.548517 2.527586
H  4.161673 2.792469 -1.569224
H  5.009216 3.312201 0.738804
H  -4.168099 2.338484 -1.061574
H  -6.77025 -0.192093 0.564885
