program: Gaussian 09
title: 000246402
version: EM64L-G09RevD.01
frameworkgroup: C1[X(C15H12ClNO3)]
method: RPBEPBE
basis: SDD
operation: Freq
keyword: #p
keyword: freq=noraman
keyword: PBEPBE/SDD
title: #p freq=noraman PBEPBE/SDD
converged: YES YES NO NO
title: Mulliken charges:
elementType: Cl O O O N C C C C C C C C C C C C C C C H H H H H H H H H H H H
charge: -0.027894 -0.228427 -0.445740 -0.251420 -0.422107 -0.731316 0.508137 0.506905 0.269657 -0.399469 -0.390918 -0.338946 -0.442365 0.265346 -0.355106 -0.303818 -0.214533 -0.229958 -0.233791 0.106656 0.319282 0.338764 0.247467 0.272402 0.310853 0.228389 0.272768 0.275674 0.236153 0.235188 0.238000 0.384169
chargesum: 0.00000
title: Mulliken charges with hydrogens summed into heavy atoms:
elementType: Cl O O O N C C C C C C C C C C C C C C C
charge: -0.027894 -0.228427 -0.061572 -0.251420 -0.083342 -0.412034 0.508137 0.506905 0.269657 -0.152003 -0.118516 -0.028094 -0.213977 0.265346 -0.082337 -0.028144 0.021620 0.005230 0.004210 0.106656
polarizability: 2.68727446e+02 2.67636797e+00 1.78515236e+02 2.97507460e+00 -2.17915141e+01 1.49725079e+02
1716.lowfreq: -3.8126 -0.0030 -0.0029 -0.0018 3.1933 5.4884 12.8287 25.7666 36.9327
frequency: 11.9834 25.7243 36.9105 52.6542 61.1780 85.0233 95.7930 116.7503 161.0442 179.0083 200.8542 208.3974 296.9330 303.6817 323.1523 361.1426 378.7407 400.0339 413.5824 469.4579 494.3830 505.1338 551.4080 577.8933 590.0955 613.3811 628.2402 640.1648 659.3262 681.9751 688.1595 704.7826 736.9412 751.7002 765.1413 773.5721 830.3711 844.6224 855.1619 860.1157 887.5789 924.1836 943.4790 979.6014 982.6326 988.8103 996.8026 1002.5973 1012.7153 1021.4862 1027.7320 1084.0306 1126.6505 1151.3305 1166.3555 1176.1335 1188.9182 1193.4151 1197.1184 1222.9645 1268.2826 1269.1963 1308.4716 1322.9581 1326.9743 1376.1574 1381.7192 1424.6848 1436.4869 1479.9966 1498.2562 1516.1871 1586.1213 1589.5367 1607.4469 1617.6308 1630.0659 1644.4009 3107.6860 3123.0156 3126.5453 3128.1321 3141.6604 3153.0465 3159.2375 3169.7884 3180.2444 3199.0103 3481.6891 3534.4820
redmass: 5.7708 6.3145 4.3486 7.1024 10.0208 6.2338 7.5892 7.8822 7.2156 8.6141 5.4206 6.6596 6.3705 5.3092 7.5169 7.1603 8.4368 2.8620 2.9530 4.5399 5.4845 2.6935 4.8661 6.1673 1.2379 6.3921 6.8298 4.5262 2.3841 1.9407 3.4561 1.9810 3.1609 6.2736 4.4684 2.2947 5.1481 1.4049 2.6076 1.5996 1.5140 2.0954 2.5993 1.3733 1.5730 3.9718 4.7686 1.3237 1.3381 2.7355 2.1905 1.6024 1.3248 1.6795 2.4049 1.0653 1.2917 1.3512 1.1869 1.7252 1.7310 2.0525 1.4570 2.6759 1.2785 5.4559 7.1981 4.4283 2.1820 2.2484 2.1961 2.6899 5.5424 5.7434 5.9387 5.0418 6.6640 8.5842 1.0876 1.0906 1.0862 1.0884 1.0911 1.0959 1.0912 1.1015 1.0947 1.0952 1.0765 1.0642
irintensity: 3.6771 0.4247 0.1570 0.2302 1.0403 1.7397 0.7031 4.2946 1.2281 2.0520 0.4954 3.4128 2.6824 1.1989 1.3231 2.0715 33.4103 1.6449 0.5103 10.3632 6.9860 63.6193 2.3647 3.9104 74.8904 0.4724 3.5480 91.4412 17.6654 83.8895 54.8334 49.8632 36.4771 19.7820 13.8600 16.3307 10.3609 29.1377 3.3395 2.0379 56.6362 0.8180 2.7994 0.1217 1.3400 0.6594 181.6354 0.1328 0.9258 168.8324 5.3913 7.6248 20.4910 166.3745 54.8135 0.2775 4.0656 1.7567 3.7384 13.6963 11.7254 22.7593 1.1916 178.4432 4.4041 207.2661 18.8868 35.4124 16.2899 14.9283 37.8101 392.2625 152.0090 19.0330 18.7613 190.0270 86.2174 331.3391 0.2537 14.2604 3.4934 0.5014 4.3428 22.1685 1.2052 20.8691 1.2409 3.1834 66.0451 53.8327
temp: 298.150 k
press: 1.00000 atm
elementType: 17 8 8 8 7 6 6 6 6 6 6 6 6 6 6 6 6 6 6 6 1 1 1 1 1 1 1 1 1 1 1 1
symmnumber: 1
zpe: 622047.7 jmol-1
zpe.correction: 0.236925 hartree
zpe.thermalcorrener: 0.254625 hartree
zpe.thermalcorrenthalpy: 0.255570 hartree
zpe.thermalcorrgfe: 0.187466 hartree
zpe.sumelectzpe: -1317.905810 hartree
zpe.sumelectthermal: -1317.888110 hartree
zpe.sumelectthermalent: -1317.887166 hartree
zpe.sumelectthermalfe: -1317.955269 hartree
dipole: 3.3063 5.0723 -1.2283
dipole: 6.1780
quadrupole: -124.3263 -122.6362 -119.8568
quadrupole: 1.7828 11.6785 -2.0413
quadrupole: -2.0532 -0.3631 2.4163 1.7828 11.6785 -2.0413
hfenergy: -1318.1427353 hartree
pointgroup: C01 [X(C15H12Cl1N1O3)]
dipole: 1.3785886 -2.0009436 0.0607492 debye
polarizability: 268.6143876|2.1067333|187.2094174|5.1487249|-12.1846265|141.1439562 unknown
InChI: InChI=1S/C15H12ClNO3/c16-13(10-4-2-1-3-5-10)14(18)17-12-8-6-11(7-9-12)15(19)20/h1-9,13,17,19H
charge 0 multiplicity 1
32 atoms
Cl 2.673008 1.946168 2.263788
O  0.690297 2.65817 -0.61636
O  -5.6258 -1.792632 0.061326
O  -6.06113 0.271922 -0.910499
N  0.362707 0.510926 0.296431
C  2.608863 1.534872 0.399572
C  3.292703 0.216719 0.084352
C  -1.02496 0.297255 0.102053
C  1.121999 1.628315 -0.025615
C  3.83461 0.054018 -1.218255
C  3.361429 -0.862632 1.001229
C  -1.883744 1.267504 -0.487144
C  -1.555838 -0.953524 0.527628
C  -3.78324 -0.272445 -0.215414
C  -3.249582 0.972628 -0.637988
C  -2.920995 -1.236309 0.370706
C  4.417305 -1.173345 -1.601537
C  3.94954 -2.088612 0.616148
C  4.474033 -2.250341 -0.686472
C  -5.231909 -0.522656 -0.402374
H  3.11652 2.386415 -0.075303
H  0.879741 -0.26678 0.72016
H  3.796661 0.885542 -1.932294
H  3.002583 -0.723548 2.027734
H  -1.47189 2.222864 -0.81544
H  -0.893175 -1.700686 0.9820
H  -3.926997 1.705856 -1.087785
H  -3.332583 -2.194992 0.696707
H  4.832913 -1.285717 -2.608694
H  4.009415 -2.91107 1.337336
H  4.933191 -3.199815 -0.981938
H  -6.603174 -1.893473 -0.091761
