program: Gaussian 09
title: 000246384
version: EM64L-G09RevD.01
frameworkgroup: C1[X(C5H11ClO3S)]
method: RPBEPBE
basis: SDD
operation: Freq
keyword: #p
keyword: freq=noraman
keyword: PBEPBE/SDD
title: #p freq=noraman PBEPBE/SDD
converged: YES YES NO NO
title: Mulliken charges:
elementType: Cl S O O O C C C C C H H H H H H H H H H H
charge: -0.069881 1.039506 -0.407608 -0.507725 -0.533132 0.022497 -0.509500 -0.564731 -0.659900 -0.627467 0.279630 0.280050 0.290552 0.260341 0.276371 0.209221 0.224599 0.250478 0.240121 0.253392 0.253187
chargesum: 0.00000
title: Mulliken charges with hydrogens summed into heavy atoms:
elementType: Cl S O O O C C C C C
charge: -0.069881 1.039506 -0.407608 -0.507725 -0.533132 0.302127 0.061102 -0.028020 0.024398 0.119232
polarizability: 1.20987992e+02 9.85369612e+00 1.06165223e+02 -2.17079041e+00 1.74129857e+00 7.84822233e+01
1716.lowfreq: -9.9102 0.0022 0.0023 0.0025 6.1025 10.4711 30.5233 36.5713 62.3373
frequency: 30.2674 36.4800 62.2662 98.6562 117.6026 154.1936 165.2845 182.2804 194.8183 231.0417 247.0070 269.8599 322.1240 339.6453 347.9801 423.2695 450.8639 532.4422 564.1997 680.0212 782.2631 804.4741 835.7074 884.8759 914.5003 945.8493 973.2433 1018.9863 1068.9473 1075.4538 1088.1436 1130.3328 1184.3513 1235.2825 1258.5149 1273.8132 1316.0543 1341.1127 1388.1286 1396.3282 1421.0430 1431.0919 1461.4301 1461.9207 1472.5747 1480.8562 2979.0376 2991.0313 2993.7123 3055.0726 3058.5158 3087.3434 3089.1354 3105.9168 3106.4643 3145.9477 3148.6049
redmass: 4.8344 4.5277 3.3205 4.2275 4.2697 5.1507 3.3232 1.3939 1.2173 3.9295 2.9991 3.0484 4.7321 4.1856 5.1517 4.1776 4.9067 7.1641 4.7148 5.1508 1.1739 4.1939 11.2280 1.4587 1.9000 4.7358 1.6310 1.8627 2.4821 1.5508 2.0222 1.7713 1.4699 1.2250 1.1855 1.2308 1.3040 1.1908 1.2033 1.1791 1.1070 1.1012 1.0354 1.0493 1.0473 1.0532 1.0848 1.0358 1.0366 1.0588 1.0565 1.0961 1.0995 1.1003 1.1025 1.1107 1.1100
irintensity: 4.6201 2.5282 3.8613 2.4134 0.2285 2.7295 1.8210 0.2891 0.2977 31.2154 0.6506 0.3476 3.1391 8.5294 13.2984 17.6545 25.8475 8.9130 106.7993 28.7378 2.3569 71.6904 62.8506 1.8529 21.2295 87.4377 32.3732 41.3695 2.5074 16.1081 7.8166 24.6589 3.7203 4.1807 4.2053 12.1905 3.1066 9.4750 17.8973 26.1515 5.7389 7.1117 19.7760 11.8075 11.0549 11.9984 6.4659 21.1072 8.3670 1.1929 18.0731 6.5891 22.5306 15.8968 8.2936 8.5849 2.3041
temp: 298.150 k
press: 1.00000 atm
elementType: 17 16 8 8 8 6 6 6 6 6 1 1 1 1 1 1 1 1 1 1 1
symmnumber: 1
zpe: 417833.8 jmol-1
zpe.correction: 0.159145 hartree
zpe.thermalcorrener: 0.172715 hartree
zpe.thermalcorrenthalpy: 0.173659 hartree
zpe.thermalcorrgfe: 0.117447 hartree
zpe.sumelectzpe: -1279.926965 hartree
zpe.sumelectthermal: -1279.913395 hartree
zpe.sumelectthermalent: -1279.912450 hartree
zpe.sumelectthermalfe: -1279.968663 hartree
dipole: -1.4672 2.0786 -1.3825
dipole: 2.8956
quadrupole: -65.4605 -79.2825 -80.0402
quadrupole: 16.1216 -1.7129 -2.5723
quadrupole: 9.4673 -4.3548 -5.1125 16.1216 -1.7129 -2.5723
hfenergy: -1280.0861092 hartree
pointgroup: C01 [X(C5H11Cl1O3S1)]
dipole: -0.5584121 0.8220257 -0.5570262 debye
dipolederiv: -0.2547699 -0.1106227 -0.0135165 -0.0064638 -0.5884753 -0.0158435 -0.0108061 -0.0501752 -0.1707927 1.78445 -0.0382713 -0.0112073 -0.0336734 1.1011271 0.0313921 0.1528806 0.0061501 1.133775 -1.3385917 -0.1403917 -0.0480956 -0.1074507 -0.4217027 0.0023445 0.0910586 0.0601848 -0.3992369 -0.6609924 0.0958595 0.0491272 0.0750871 -0.6187639 -0.0053358 0.1202978 -0.0270419 -0.4734343 -0.5710689 -0.0196296 0.0270757 -0.0776408 -0.5096663 -0.0183396 -0.0207759 0.0318503 -0.6506194 0.7737073 -0.024318 -0.0408178 0.1188619 0.1902778 -0.0219543 -0.518793 -0.0926954 0.0867793 0.0979263 0.2019859 -0.021249 0.2668398 0.192514 -0.0560191 -0.0693911 -0.0540409 0.0058413 0.0545579 0.162479 0.0223999 0.0143774 0.6594706 0.0705688 0.1041086 0.0750581 0.2093167 -0.0933489 0.086522 -0.0024986 -0.0241668 -0.1684183 0.0142826 0.0529169 0.0538324 0.1019819 -0.1044458 -0.0579106 -0.0331196 -0.2246533 -0.1460386 0.0255635 0.079895 0.087463 -0.0035334 0.0576865 -0.0018199 -0.065149 -0.0203994 0.057007 -0.0265378 0.0580144 -0.0142597 0.0050869 0.0548855 -0.0435026 -0.0146841 -0.0625693 0.0115521 -0.0041199 -0.0294915 -0.0138642 -0.0283291 0.0458571 -0.0116678 0.0227923 -0.0075752 0.0010169 0.0054728 0.029978 0.0176755 0.0710857 -0.1008531 -0.0320729 0.0553008 -0.0044521 -0.0024004 0.0015404 0.0793578 -0.0093425 0.0561883 0.1071383 -0.0293045 -0.0106597 -0.0396366 -0.0186888 -0.0536846 -0.0675851 -0.0047955 -0.0567112 -0.0998317 -0.0506185 0.1110075 -0.045964 0.0822912 -0.0195331 0.1305107 0.0038226 0.0073929 0.0752616 -0.0350255 -0.0516008 -0.015218 0.0871467 0.0177115 -0.0980682 -0.0530655 -0.1002858 0.0236092 0.0919994 -0.0404822 0.0815231 -0.04092 0.0269235 -0.044278 0.0301888 0.0913821 0.0249004 -0.1016552 0.0172254 -0.0605536 -0.0394993 0.0807969 -0.0236774 0.0524623 0.0989776 0.0985645 0.0073353 0.0326947 0.0288873 0.1346452 -0.0025586 -0.036178 -0.0421136 -0.0761157 0.0253579 0.0506296 0.0154568 0.1448404 0.0375252 -0.0526702 0.0200258 -0.0572935 0.0912509 unknown
polarizability: 121.4792387|9.4020846|105.7046653|-2.5788954|1.1964607|78.4515349 unknown
InChI: InChI=1S/C5H11ClO3S/c1-3-10(7,8)9-5(2)4-6/h5H,3-4H2,1-2H3
charge 0 multiplicity 1
21 atoms
Cl -1.679692 2.043785 -0.020692
S  1.407513 -0.647501 -0.013329
O  -0.27099 -0.723964 -0.896242
O  2.325855 -1.845745 -0.583604
O  1.134516 -0.511504 1.583187
C  -1.432332 -0.782163 0.021965
C  1.979282 1.048674 -0.749411
C  -2.392793 0.332755 -0.397673
C  -2.092617 -2.168964 -0.092463
C  3.371388 1.389533 -0.229776
H  -1.079151 -0.609649 1.060233
H  1.922545 0.864716 -1.833648
H  1.172527 1.723271 -0.422831
H  -3.336888 0.28086 0.165895
H  -2.577243 0.324422 -1.481957
H  -2.952853 -2.255349 0.596748
H  -2.439756 -2.35872 -1.123311
H  -1.357405 -2.947339 0.171112
H  3.67585 2.361742 -0.660182
H  3.383099 1.485938 0.869151
H  4.116646 0.634503 -0.532474
